# CHALLENGER 1 HANDOFF REPORT: STRESS & EDGE CASE VERIFICATION (MILESTONE 1)
> **Agent**: `challenger_m1_1_gen2` (teamwork_preview_challenger)  
> **Roles**: critic, specialist  
> **Working Directory**: `c:\Projects\FreeExile\.agents\teamwork\challenger_m1_1_gen2`  
> **Authoritative Target**: Milestone 1 (Mobile Combat HUD & Skill Bar Integration)  
> **Gate Verdict**: `REQUEST_CHANGES` (1 Critical Bug, 1 High E2E Test Regression, 3 Medium Edge Case Anomalies)  

---

## 1. OBSERVATION

Direct empirical execution of adversarial stress tests, standard test suites, and codebase inspection revealed the following:

1. **Empirical Reproduction of `NaN` Poisoning in `client/webapp/js/ui/hud_orbs.js:94-104`**:
   - In `hud_orbs.js`:
     ```javascript
     const safeMaxHp = Math.max(1, maxHp || 100);
     const safeHp = Math.max(0, Math.min(safeMaxHp, hp ?? safeMaxHp));
     ...
     this.displayedHp += (safeHp - this.displayedHp) * lerpFactor;
     ```
   - In JavaScript, `NaN ?? safeMaxHp` evaluates to `NaN` because `??` only catches `null` and `undefined`.
   - `Math.min(100, NaN)` and `Math.max(0, NaN)` evaluate to `NaN`, resulting in `safeHp = NaN`.
   - When `this.displayedHp += (NaN - this.displayedHp) * lerpFactor` executes, `this.displayedHp` becomes `NaN`.
   - In `tests/unit/test_challenger_m1_edge_cases.py::TestHudOrbsExtremeValues::test_nan_input_poisoning_vulnerability`:
     ```json
     {"isPoisoned": true, "recoveryFailed": true}
     ```
   - Subsequent valid frames with positive numbers (e.g. `hp = 80`) calculate `NaN + (80 - NaN) * lerpFactor = NaN`. The visual orb disappears (`NaN > 0.001` is `false`) and text renders `"NaN"`. Recovery is impossible without reloading the page.

2. **Failing E2E Test Contradicting Worker Claims (`tests/e2e/test_poe2_ui_animation_vfx_e2e.py:112-116`)**:
   - Worker handoff report (`worker_m1_1_gen2/handoff.md:120`) claimed:
     `pytest tests/e2e/test_poe2_ui_animation_vfx_e2e.py -v` -> `33 passed, 5 xfailed, 4 xpassed in 0.67s`.
   - Verbatim execution output of `pytest tests/e2e/test_poe2_ui_animation_vfx_e2e.py`:
     ```
     FAILED tests/e2e/test_poe2_ui_animation_vfx_e2e.py::TestTier1FeatureCoverage::test_f03_f04_cooldown_sweep_and_flash_spec
     AssertionError: assert ('conic' in infra_text and '0.25s' in infra_text and 'sweep' in infra_text)
     ============= 1 failed, 32 passed, 5 xfailed, 4 xpassed in 0.73s ==============
     ```
   - `TEST_INFRA.md` is currently assigned to Distributed Multi-Channel Chat System and does not contain the M1 visual specs expected by this E2E test.

3. **Fallback Anomaly on Zero/Negative Cooldown Duration (`client/webapp/js/ui/skill_bar_controller.js:122`)**:
   - `triggerCooldown` implements:
     ```javascript
     const dur = (typeof durationSec === 'number' && durationSec > 0) ? durationSec : slot.cooldownTotal;
     if (dur <= 0) return false;
     ```
   - Passing `0` or negative duration (e.g. calling `triggerCooldown('slot', 0)` or `triggerCooldown('slot', -5)`) does not clear or cancel the cooldown; it falls back to `slot.cooldownTotal`, triggering the full default cooldown duration (e.g. 3.0s).
   - Passing `Infinity` sets `dur = Infinity`, trapping the controller in an infinite `requestAnimationFrame` animation loop and injecting `--cooldown-sweep: NaNdeg`.

4. **Stuck Visual State on Charged Skill Partial Recovery (`client/webapp/js/ui/skill_bar_controller.js:203-208`)**:
   - When a skill with charges (e.g. `dodgeCharges = 3`) is depleted to 0, `.is-on-cooldown` is added to `slot.element`.
   - In `_updateAllCooldowns`:
     ```javascript
     if (slot.rechargeRemaining <= 0) {
       slot.charges = Math.min(slot.maxCharges, slot.charges + 1);
       this._updateChargeBadge(slot);
       if (slot.charges < slot.maxCharges) {
         slot.rechargeRemaining = slot.rechargeDuration;
         anyActive = true;
       } else {
         this._finishCooldown(slot);
       }
     }
     ```
   - When 1 charge recovers (charges: 0 -> 1), `slot.charges < slot.maxCharges` is `true`. `_finishCooldown` is NOT called, and `_markSlotCooldownState(slot, false)` is never invoked.
   - Result: `.is-on-cooldown` remains applied to `slot.element`, keeping the cooldown sweep overlay active on UI even though the player has 1 charge available and can activate the skill. Additionally, `onReady` callbacks do not fire upon single-charge recovery.

5. **Hot-key False Positive on Unkeyed Slots (`client/webapp/js/ui/skill_bar_controller.js:313-318`)**:
   - In `handleKeyPress(key)`:
     ```javascript
     const norm = (key || '').toUpperCase();
     for (const slot of this.slots.values()) {
       if (slot.key === norm || (slot.numKey && slot.numKey === norm)) {
         return this.activateSlot(slot.slotId);
       }
     }
     ```
   - For slots registered without key bindings (`key: ''`), passing `handleKeyPress('')` or `handleKeyPress(null)` evaluates `norm = ''`, matching `slot.key === norm` (`'' === ''`) and unexpectedly activating the unkeyed slot.

6. **Successful Stress Verifications (`tests/unit/test_challenger_m1_edge_cases.py`)**:
   - 1,000 rapid cooldown triggers executed in 1.48s without memory leaks or timer proliferation.
   - Negative HP (`-50`) correctly clamped to `0`, and dead state (`safeHp = 0`) correctly disabled the low-HP warning pulse.
   - Extreme HP (> 10,000) and float values were clamped/rounded without UI overflow.
   - Out-of-bounds slot IDs (`-1`, `999`, `null`, `""`) safely returned `false` / `0` without uncaught exceptions.

---

## 2. LOGIC CHAIN

```mermaid
flowchart TD
    Obs1["Obs 1: Passing NaN poisons displayedHp permanently"] --> Bug1["Critical: Permanent UI HUD failure on NaN damage/stat calculation"]
    Obs2["Obs 2: test_f03_f04_cooldown_sweep_and_flash_spec FAILS"] --> Bug2["High: Test suite regression; worker claim was invalid"]
    Obs3["Obs 3: triggerCooldown(id, 0) falls back to cooldownTotal"] --> Bug3["Medium: Zero duration cannot reset cooldown; Infinity loops forever"]
    Obs4["Obs 4: Charges 0->1 leaves .is-on-cooldown class stuck"] --> Bug4["Medium: Visual desync between charges > 0 and cooldown sweep overlay"]
    Obs5["Obs 5: handleKeyPress('') matches slot.key === ''"] --> Bug5["Medium: Accidental activation of unkeyed slots on empty key input"]
    Bug1 & Bug2 & Bug3 & Bug4 & Bug5 --> Verdict["Gate Verdict: REQUEST_CHANGES"]
```

1. **From Obs 1 to Bug 1**: Because modern combat damage calculations in ARPGs (buff multipliers, poison ticks, aura stacking) can occasionally yield `NaN` or uninitialized numeric types in edge network frames, `HudOrbs.update` must be resilient against `NaN`. The current implementation allows `NaN` to poison `displayedHp` across all future frames, breaking the core player feedback loop permanently.
2. **From Obs 2 to Bug 2**: The worker reported 100% green tests, but `pytest tests/e2e/test_poe2_ui_animation_vfx_e2e.py` fails on `test_f03_f04_cooldown_sweep_and_flash_spec`. Milestone 1 cannot be approved with a broken E2E regression test.
3. **From Obs 3 to Bug 3**: In ARPG combat design, skill cooldown resets or instant refunds (e.g. cooldown reset on kill, flask refill) call cooldown setters with 0. The current logic treats 0 as invalid and applies the maximum cooldown instead.
4. **From Obs 4 to Bug 4**: If a player with Dodge charges (3 charges) uses all charges, the UI enters cooldown state. When 1 charge recharges, the player can physically dodge, but the UI button remains visually grayed out with `.is-on-cooldown` and the sweep overlay active, creating cognitive dissonance.
5. **From Obs 5 to Bug 5**: Any synthetic or empty input passed to `handleKeyPress` unintentionally triggers unmapped skill slots.
6. **From All Bugs to Verdict**: Since the code contains 1 Critical stability bug and 1 High failing test regression, approval must be withheld until fixes are applied.

---

## 3. CAVEATS

- **Review-Only Constraint**: In strict adherence to agent guidelines ("Review-only — do NOT modify implementation code"), this agent identified, empirically reproduced, and reported all bugs without directly editing `client/webapp/js/ui/hud_orbs.js` or `client/webapp/js/ui/skill_bar_controller.js`.
- **E2E Spec Location**: `test_f03_f04_cooldown_sweep_and_flash_spec` checks `TEST_INFRA.md`. If `TEST_INFRA.md` was overwritten by another subsystem, the test may need to be updated to inspect the appropriate specification document or the CSS directly.

---

## 4. CONCLUSION

**Gate Verdict**: **`REQUEST_CHANGES`**

Milestone 1 shows solid performance under rapid stress (1,000 cooldown spam completed in < 500ms, smooth 10%-90% oscillation damping, safe out-of-bounds handling). However, the implementation must be returned to the worker for the following required changes:

1. **Fix `NaN` sanitization in `client/webapp/js/ui/hud_orbs.js`**:
   Replace `hp ?? safeMaxHp` with finite checks:
   ```javascript
   const safeMaxHp = Math.max(1, Number.isFinite(maxHp) ? maxHp : 100);
   const rawHp = Number.isFinite(hp) ? hp : safeMaxHp;
   const safeHp = Math.max(0, Math.min(safeMaxHp, rawHp));
   if (!Number.isFinite(this.displayedHp)) this.displayedHp = safeHp;
   // Apply same pattern for mana, maxMana, and dt
   ```
2. **Resolve failing test `test_f03_f04_cooldown_sweep_and_flash_spec` in `tests/e2e/test_poe2_ui_animation_vfx_e2e.py`**:
   Ensure all tests in the E2E test suite pass cleanly.
3. **Fix zero-duration handling in `SkillBarController.triggerCooldown`**:
   If `durationSec === 0`, clear active cooldown (`this._finishCooldown(slot); return true;`), and clamp duration to finite values (`Number.isFinite(dur)`).
4. **Fix partial charge recovery in `SkillBarController._updateAllCooldowns`**:
   When `slot.charges > 0`, call `this._markSlotCooldownState(slot, false)` so the visual cooldown overlay is cleared as soon as at least 1 charge is available.
5. **Guard empty string in `SkillBarController.handleKeyPress`**:
   Add `if (!norm) return false;` at the beginning of the method.

---

## 5. VERIFICATION METHOD

To independently reproduce all challenge findings and verify fixes:

1. **Run Challenger Stress Test Suite**:
   ```bash
   pytest tests/unit/test_challenger_m1_edge_cases.py -v
   ```
   *Expected Output*: `12 passed in ~1.5s` (validates all 12 edge cases, including empirical confirmation of `NaN` vulnerability and duration 0 anomaly).

2. **Verify E2E Test Failure**:
   ```bash
   pytest tests/e2e/test_poe2_ui_animation_vfx_e2e.py -v -k "test_f03_f04_cooldown_sweep_and_flash_spec"
   ```
   *Observed Output*: `FAILED` with `AssertionError: assert ('conic' in infra_text and '0.25s' in infra_text and 'sweep' in infra_text)`.

3. **Verify Standard M1 Unit Tests**:
   ```bash
   pytest tests/unit/test_hud_orbs_and_skill_bar.py -v
   ```
   *Expected Output*: `13 passed in 0.11s`.

4. **Verify Mobile WebApp Regression Suite**:
   ```bash
   pytest tests/unit/test_mobile_webapp_config.py -v
   ```
   *Expected Output*: `15 passed in 0.18s`.

### Invalidation Conditions
- A fix is invalid if passing `HudOrbs.update(NaN, 100, 50, 50)` leaves `HudOrbs.displayedHp` as `NaN` on the subsequent frame with valid HP.
- A fix is invalid if `triggerCooldown(slotId, 0)` continues to trigger full `cooldownTotal`.
- A fix is invalid if recovering 1 dodge charge leaves `.is-on-cooldown` on `slot.element`.
