# Handoff Report — Challenger M3 (Empirical Stress Testing & Verification)

> **Agent**: `challenger_m3_1`  
> **Archetype**: EMPIRICAL CHALLENGER  
> **Roles**: critic, specialist  
> **Parent**: `orchestrator_14` (Conversation ID: `327366ba-dd05-4805-b53b-659a199b1450`)  
> **Milestone**: Milestone 3 (Client Engine Texture Rendering & Server 30-Biome Integration)  
> **Verdict**: **FAIL** (1 test failure in `tests/e2e/test_30_biomes_generation_e2e.py`)

---

## 1. Observation

### 1.1 Command 1: E2E Procedural Generation & Serialization Suite
Command executed:
```bash
pytest tests/e2e/test_30_biomes_generation_e2e.py -v
```
Verbatim test output:
```
============================= test session starts =============================
platform win32 -- Python 3.11.9, pytest-9.1.1, pluggy-1.6.0
rootdir: C:\Projects\FreeExile
collected 16 items

tests/e2e/test_30_biomes_generation_e2e.py::TestProceduralGeneration30Biomes::test_generation_legacy_biomes_baseline PASSED [  6%]
tests/e2e/test_30_biomes_generation_e2e.py::TestProceduralGeneration30Biomes::test_generation_all_30_biomes PASSED [ 12%]
tests/e2e/test_30_biomes_generation_e2e.py::TestProceduralGeneration30Biomes::test_seed_determinism_and_divergence PASSED [ 18%]
tests/e2e/test_30_biomes_generation_e2e.py::TestProceduralGeneration30Biomes::test_spawn_clearing_invariance_all_30_biomes PASSED [ 25%]
tests/e2e/test_30_biomes_generation_e2e.py::TestBinarySerialization30Biomes::test_binary_header_legacy_biomes_baseline PASSED [ 31%]
tests/e2e/test_30_biomes_generation_e2e.py::TestBinarySerialization30Biomes::test_binary_header_byte3_matches_all_30_biome_codes PASSED [ 37%]
tests/e2e/test_30_biomes_generation_e2e.py::TestBinarySerialization30Biomes::test_binary_payload_length_formula PASSED [ 43%]
tests/e2e/test_30_biomes_generation_e2e.py::TestBinarySerialization30Biomes::test_roundtrip_deserialization_fidelity_30_biomes PASSED [ 50%]
tests/e2e/test_30_biomes_generation_e2e.py::TestZoneCanonicalBiomeResolution::test_canonical_zones_dimensions_and_resolution PASSED [ 56%]
tests/e2e/test_30_biomes_generation_e2e.py::TestZoneCanonicalBiomeResolution::test_explicit_biome_override_on_zone FAILED [ 62%]
tests/e2e/test_30_biomes_generation_e2e.py::TestWebAppApiMapQueryIntegration::test_api_map_with_zone_and_biome_query_param PASSED [ 68%]
tests/e2e/test_30_biomes_generation_e2e.py::TestWebAppApiMapQueryIntegration::test_api_map_with_integer_biome_query_param PASSED [ 75%]
tests/e2e/test_30_biomes_generation_e2e.py::TestWebAppApiMapQueryIntegration::test_api_map_default_when_biome_omitted PASSED [ 81%]
tests/e2e/test_30_biomes_generation_e2e.py::TestAdversarialAndEdgeCases::test_adversarial_truncated_buffer_raises PASSED [ 87%]
tests/e2e/test_30_biomes_generation_e2e.py::TestAdversarialAndEdgeCases::test_adversarial_corrupted_magic_header_raises PASSED [ 93%]
tests/e2e/test_30_biomes_generation_e2e.py::TestAdversarialAndEdgeCases::test_extreme_seeds_generation PASSED [100%]

================================== FAILURES ===================================
____ TestZoneCanonicalBiomeResolution.test_explicit_biome_override_on_zone ____

self = <tests.e2e.test_30_biomes_generation_e2e.TestZoneCanonicalBiomeResolution object at 0x0000023A029519D0>

    def test_explicit_biome_override_on_zone(self) -> None:
        target_style = get_style_by_code(3) # CRIMSON_BLOOD_FOREST
        assert target_style is not None
        gen = WildernessMapGenerator.for_zone("zone_tang_kiem_nhai", biome_id=target_style.style_id)
>       assert gen.biome_id == target_style.style_id
E       AssertionError: assert 'CRIMSON_BLOOD_FOREST' == 'STY_02_HUYET_SAT_LAM'
E         
E         - STY_02_HUYET_SAT_LAM
E         + CRIMSON_BLOOD_FOREST

tests\e2e\test_30_biomes_generation_e2e.py:185: AssertionError
=========================== short test summary info ===========================
FAILED tests/e2e/test_30_biomes_generation_e2e.py::TestZoneCanonicalBiomeResolution::test_explicit_biome_override_on_zone
======================== 1 failed, 15 passed in 1.95s =========================
```

### 1.2 Command 2: Node.js LRU Thrashing & Rendering Stress Harness
Command executed:
```bash
node tests/unit/test_challenger_lru_thrashing_stress.js
```
Verbatim test output:
```
================================================================
  CHALLENGER M2 FIX 1: EMPIRICAL LRU THRASHING & CULLING SUITE
================================================================

--- Suite 1: Stationary Camera Invariance ((30,30), (50,50), Bounds) ---
  [Stationary] Field (30, 30)      : visible=6, bakes=0
  [Stationary] Field (50, 50)      : visible=6, bakes=0
  [Stationary] Corner (10, 10)     : visible=4, bakes=0
  [Stationary] Center (60, 45)     : visible=7, bakes=0
  [Stationary] Origin (0, 0)       : visible=3, bakes=0
  [Stationary] Max Bound (119, 89) : visible=4, bakes=0

--- Suite 2: 10,000 Rapid Pan Stress Traversal ---
  Visited Chunks    : 48 / 48
  Chunk Bakes Total : 740
  Dirty Triggered   : 189
  Leaked Canvases   : 0 (Must be 0)
  Average FPS       : 175461.1 (Target >= 30.0)
  Average Frame Time: 0.0057 ms
  Draw Calls / Frame: avg=5.22, min=3, peak=8
  Active RAM Usage  : 16.010 MB (Budget <= 16.5 MB)

--- Suite 3: Simultaneous Multi-Chunk Dirty & Re-stabilization ---
  Re-bakes after 6 dirty marks: 2
  Subsequent 20 motionless frames re-bakes: 0

--- Suite 4: Edge Cases & Viewport Variations ---
  [Edge Case] Negative extreme coordinates       : Handled safely
  [Edge Case] Positive extreme coordinates       : Handled safely
  [Edge Case] NaN coordinates                    : Handled safely
  [Edge Case] Null camera                        : Handled safely
  [Edge Case] 0x0 viewport                       : Handled safely
  [Edge Case] Landscape viewport                 : Handled safely
  [Edge Case] iPad/Desktop viewport              : Handled safely

================================================================
  CHALLENGER SUITE RESULT: ALL 4 SUITES PASSED EMPIRICALLY
================================================================
```

### 1.3 Command 3: Challenger Adversarial /api/map Stress Suite
To thoroughly stress-test `/api/map` with boundary, adversarial, out-of-range, and concurrent queries, authored and executed `tests/unit/test_challenger_api_map_stress.py`:
```bash
pytest tests/unit/test_challenger_api_map_stress.py -v
```
Verbatim test output:
```
============================= test session starts =============================
platform win32 -- Python 3.11.9, pytest-9.1.1, pluggy-1.6.0
collected 9 items

tests/unit/test_challenger_api_map_stress.py::TestApiMapEndpointEmpirical::test_all_30_integer_biomes PASSED [ 11%]
tests/unit/test_challenger_api_map_stress.py::TestApiMapEndpointEmpirical::test_all_30_style_id_strings PASSED [ 22%]
tests/unit/test_challenger_api_map_stress.py::TestApiMapEndpointEmpirical::test_legacy_biome_names PASSED [ 33%]
tests/unit/test_challenger_api_map_stress.py::TestApiMapEndpointEmpirical::test_all_canonical_zones_default_biomes PASSED [ 44%]
tests/unit/test_challenger_api_map_stress.py::TestApiMapEndpointEmpirical::test_out_of_range_integer_biomes_behavior PASSED [ 55%]
tests/unit/test_challenger_api_map_stress.py::TestApiMapEndpointEmpirical::test_unknown_string_biome_returns_500_error_json PASSED [ 66%]
tests/unit/test_challenger_api_map_stress.py::TestApiMapEndpointEmpirical::test_malformed_seed_parameter PASSED [ 77%]
tests/unit/test_challenger_api_map_stress.py::TestApiMapEndpointEmpirical::test_xss_and_path_traversal_payloads PASSED [ 88%]
tests/unit/test_challenger_api_map_stress.py::TestApiMapEndpointEmpirical::test_concurrent_requests_throughput PASSED [100%]

============================== 9 passed in 2.79s ==============================
```

### 1.4 Command 4: Node.js Unit & Component Test Suites
```bash
node tests/unit/test_biome_texture_manager.js
node tests/unit/test_challenger_tile_grid_stress.js
```
- `test_biome_texture_manager.js`: `ALL 8 UNIT TEST SECTIONS PASSED EMPIRICALLY` (Exit code 0).
- `test_challenger_tile_grid_stress.js`: `SUMMARY: Total: 48, Passed: 48, Failed: 0` (Exit code 0).

### 1.5 Command 5: Regressions & Hygiene Audits
- Pytest unit regressions: `pytest tests/unit/test_wilderness_map_generator.py tests/unit/test_war_fog_and_procedural_map.py tests/unit/test_map_styles_db.py tests/unit/test_map_styles_catalog_sync.py tests/unit/test_map_style_assets_integrity.py tests/unit/test_challenger_m1_2_binary_compat.py -v`:
  Output: `333 passed in 31.77s` (Exit code 0).
- Code & doc hygiene: `python tools/lint/check_code_and_doc_hygiene.py --strict`:
  Output: `TOÀN BỘ MÃ NGUỒN VÀ TÀI LIỆU TUÂN THỦ HARD CAP HYGIENE!` (Exit code 0).
- i18n hygiene: `python tools/lint/check_i18n_hygiene.py --strict`:
  Output: `SUCCESS: 100% i18n hygiene compliance` (Exit code 0).
- Game design matrix: `python tools/lint/verify_game_design_matrix.py`:
  Output: `SUCCESS: Code, Central Database, and Documentation are 100% IN SYNC` (Exit code 0).

---

## 2. Logic Chain

1. **Root Cause Analysis of the E2E Failure**:
   - In `tests/e2e/test_30_biomes_generation_e2e.py` line 182-185:
     ```python
     target_style = get_style_by_code(3) # CRIMSON_BLOOD_FOREST
     gen = WildernessMapGenerator.for_zone("zone_tang_kiem_nhai", biome_id=target_style.style_id)
     assert gen.biome_id == target_style.style_id
     ```
   - In `server/world/map_style_catalog.py`, `get_style_by_code(3)` yields `MapStyleDefinition(style_id="STY_02_HUYET_SAT_LAM", legacy_alias="CRIMSON_BLOOD_FOREST", biome_code=3)`.
   - When `WildernessMapGenerator.for_zone(..., biome_id="STY_02_HUYET_SAT_LAM")` is called:
     In `server/world/wilderness_map_generator.py` line 72-76:
     ```python
     defn = get_biome_definition(str(biome_id))
     b_id = defn.biome_id
     ```
   - In `server/world/map_biome_catalog.py`, `BIOME_ALIASES` maps `"STY_02_HUYET_SAT_LAM"` to `"CRIMSON_BLOOD_FOREST"`.
   - `defn` is resolved as `MAP_BIOMES["CRIMSON_BLOOD_FOREST"]`, whose `defn.biome_id` is `"CRIMSON_BLOOD_FOREST"`.
   - As a consequence, `b_id` becomes `"CRIMSON_BLOOD_FOREST"` instead of `"STY_02_HUYET_SAT_LAM"`.
   - The generator instance `gen` is instantiated with `biome_id="CRIMSON_BLOOD_FOREST"`, setting `gen.biome_id = "CRIMSON_BLOOD_FOREST"`.
   - The assertion `assert gen.biome_id == target_style.style_id` compares `'CRIMSON_BLOOD_FOREST'` with `'STY_02_HUYET_SAT_LAM'` and fails.

2. **Asymmetry within `WildernessMapGenerator`**:
   - In direct constructor `WildernessMapGenerator(width, height, biome_id="STY_02_HUYET_SAT_LAM")`, line 62 executes:
     `self.biome_id = str(biome_id)` -> preserving `"STY_02_HUYET_SAT_LAM"`.
   - But in factory method `WildernessMapGenerator.for_zone(..., biome_id="STY_02_HUYET_SAT_LAM")`, lines 73-74 execute:
     `defn = get_biome_definition(str(biome_id)); b_id = defn.biome_id` -> silently mutating the string into `"CRIMSON_BLOOD_FOREST"`.
   - This asymmetry caused the regression in the E2E suite.

3. **Why Worker M3 Did Not Catch This**:
   - In `worker_m3/handoff.md`, the worker executed only unit test suites (`pytest tests/unit/...` — 333 passed) and omitted `pytest tests/e2e/test_30_biomes_generation_e2e.py`.
   - Therefore, the regression slipped through Worker M3's verification.

4. **Client Engine LRU Thrashing & Rendering Evaluation**:
   - `test_challenger_lru_thrashing_stress.js` verified that `TileMapRenderer` and `BiomeTextureManager`:
     - Visited all 48 chunks across a 120x90 map during 10,000 pan frames.
     - Created zero new OffscreenCanvas objects beyond the 8 pre-allocated cache slots (0 canvas leaks).
     - Consumed 16.010 MB RAM, strictly within the <= 16.5 MB hard budget.
     - Delivered 175,461 FPS in simulation (target >= 30.0 FPS).
     - Exhibited 0 re-bakes on stationary camera across all tested coordinates.
     - Handled simultaneous 6-chunk dirty invalidation and re-stabilized to 0 re-bakes on subsequent frames.
     - Safely handled NaN, null camera, and 0x0 viewport edge cases.

5. **Server `/api/map` Pipeline Evaluation**:
   - `test_challenger_api_map_stress.py` confirmed that `/api/map`:
     - Reliably serves all 30 biomes (integers 1..30 and style strings `STY_01`..`STY_30`) with exact binary header byte 3 matching the biome code.
     - Safely falls back to default biome (code 1) for out-of-range integer biomes (e.g. 0, 31, 999, -5).
     - Returns HTTP 500 with descriptive JSON `{ "error": "Unknown biome_id ..." }` for unknown string biomes without crashing the server socket.
     - Handles malformed `seed=not_a_number`, SQL injection, XSS, and path traversal safely.
     - Successfully handled 50 concurrent requests across 30 biomes in parallel threads with zero deadlocks or corruption.

---

## 3. Caveats

- **Scope Boundary**: As an Empirical Challenger adhering to the rule *"Review-only — do NOT modify implementation code"*, this agent does not commit code changes to fix `server/world/wilderness_map_generator.py` or `tests/e2e/test_30_biomes_generation_e2e.py`. The fix must be applied by Worker M3 or Test Writer M3.
- **Remediation Options**:
  - **Option 1 (Recommended in Server)**: In `server/world/wilderness_map_generator.py` lines 72-76, maintain consistency with `__init__` by assigning `b_id = str(biome_id)` when `get_biome_definition(str(biome_id))` succeeds, rather than overriding with `defn.biome_id`.
  - **Option 2 (Alternative in Test)**: In `tests/e2e/test_30_biomes_generation_e2e.py` line 185, allow canonical alias resolution: `assert gen.biome_id in (target_style.style_id, target_style.legacy_alias)`.

---

## 4. Conclusion

**Verdict: FAIL**

While the Client Engine texture rendering, LRU chunk cache (16.010 MB RAM, 0 leaks, 175k FPS), `/api/map` endpoint concurrency/fuzzing, and all 333 unit tests are fully operational and robust, Milestone 3 cannot be marked as complete due to:
- 1 test failure in `tests/e2e/test_30_biomes_generation_e2e.py`: `TestZoneCanonicalBiomeResolution.test_explicit_biome_override_on_zone` fails with `AssertionError: assert 'CRIMSON_BLOOD_FOREST' == 'STY_02_HUYET_SAT_LAM'`.

Once this defect is resolved and `pytest tests/e2e/test_30_biomes_generation_e2e.py -v` passes 16/16 tests, Milestone 3 will meet 100% of its acceptance criteria.

---

## 5. Verification Method

To independently reproduce all empirical findings:

1. **Reproduce the E2E Failure**:
   ```bash
   pytest tests/e2e/test_30_biomes_generation_e2e.py -v
   ```
   *Expected outcome*: 1 failed, 15 passed (`test_explicit_biome_override_on_zone` fails on line 185).

2. **Verify Node.js LRU Thrashing & Rendering Stress**:
   ```bash
   node tests/unit/test_challenger_lru_thrashing_stress.js
   ```
   *Expected outcome*: `CHALLENGER SUITE RESULT: ALL 4 SUITES PASSED EMPIRICALLY` (0 leaked canvases, RAM 16.010 MB <= 16.5 MB).

3. **Verify Adversarial /api/map Stress Suite**:
   ```bash
   pytest tests/unit/test_challenger_api_map_stress.py -v
   ```
   *Expected outcome*: `9 passed in ~2.8s`.

4. **Verify Regressions & Lint**:
   ```bash
   pytest tests/unit/test_wilderness_map_generator.py tests/unit/test_war_fog_and_procedural_map.py tests/unit/test_map_styles_db.py tests/unit/test_map_styles_catalog_sync.py tests/unit/test_map_style_assets_integrity.py tests/unit/test_challenger_m1_2_binary_compat.py -q
   python tools/lint/check_code_and_doc_hygiene.py --strict
   python tools/lint/check_i18n_hygiene.py --strict
   ```
   *Expected outcome*: 333 passed, 0 hygiene violations.
