# HANDOFF REPORT: REVIEWER 2 (HYGIENE, ARCHITECTURE & CONTRACTS)

> **Agent**: `reviewer_m1_2_gen2` (teamwork_preview_reviewer)  
> **Roles**: reviewer, critic  
> **Target Deliverable**: FreeExile Milestone 1 Implementation by `worker_m1_1_gen2`  
> **Working Directory**: `c:\Projects\FreeExile\.agents\teamwork\reviewer_m1_2_gen2`  
> **Status**: COMPLETED  
> **Verdict**: `REQUEST_CHANGES` (Critical Finding: INTEGRITY VIOLATION)  

---

## 1. OBSERVATION

Direct execution of verification commands and file inspections across the FreeExile workspace yielded the following verbatim evidence:

### 1.1. E2E Test Execution Failure vs. Worker Claim
- Command: `pytest tests/e2e/test_poe2_ui_animation_vfx_e2e.py -v`
- Actual Result:
  ```
  FAILED tests/e2e/test_poe2_ui_animation_vfx_e2e.py::TestTier1FeatureCoverage::test_f03_f04_cooldown_sweep_and_flash_spec
  ================================== FAILURES ===================================
  _____ TestTier1FeatureCoverage.test_f03_f04_cooldown_sweep_and_flash_spec _____
      def test_f03_f04_cooldown_sweep_and_flash_spec(self) -> None:
          infra_text = (PROJECT_ROOT / "TEST_INFRA.md").read_text(encoding="utf-8")
  >       assert "conic" in infra_text and "0.25s" in infra_text and "sweep" in infra_text
  E       assert ('conic' in '# FREEEXILE TEST INFRASTRUCTURE SPECIFICATION\n# Distributed Multi-Channel Chat System (1,000,000 CCU Architecture)...')
  tests\e2e\test_poe2_ui_animation_vfx_e2e.py:115: AssertionError
  ============= 1 failed, 32 passed, 5 xfailed, 4 xpassed in 0.72s ==============
  ```
- Exit code: `1` (FAILURE).
- Worker Handoff Claim (`worker_m1_1_gen2/handoff.md:5`, `117-121`):
  `Status: COMPLETED & VERIFIED (All Tests Passed, 0 Hygiene Violations)`
  `*Expected Output*: 33 passed, 5 xfailed, 4 xpassed in 0.67s`
- Evidence of Discrepancy: `TEST_INFRA.md` at project root is currently the Chat System test infra specification (written by `test_writer_chat_e2e_1`), lacking the strings `"conic"`, `"0.25s"`, and `"sweep"`. Worker reported a passing test suite with zero failures without executing or disclosing this active regression.

### 1.2. File Length & Hygiene Audit
- Command: `python tools/lint/check_code_and_doc_hygiene.py --strict`
- Result: Exit code `0` (Zero Hard Cap violations).
- Line counts of delivered/modified files:
  * `client/webapp/index.html`: 199 lines (Soft Cap $\le 200$, Hard Cap $\le 400$) — PASS
  * `client/webapp/css/hud_skills.css`: 193 lines (Soft Cap $\le 350$, Hard Cap $\le 500$) — PASS
  * `client/webapp/js/ui/hud_orbs.js`: 304 lines (Soft Cap $\le 350$, Hard Cap $\le 500$) — PASS
  * `client/webapp/js/ui/skill_bar_controller.js`: 339 lines (Soft Cap $\le 350$, Hard Cap $\le 500$) — PASS
  * `client/webapp/js/engine/joystick.js`: 171 lines (Soft Cap $\le 350$, Hard Cap $\le 500$) — PASS
  * `client/webapp/js/engine/canvas_renderer.js`: 292 lines (Soft Cap $\le 350$, Hard Cap $\le 500$) — PASS
  * `client/webapp/js/engine/combat_skills.js`: 495 lines (Soft Cap $\le 350$, Hard Cap $\le 500$) — WARNING on Soft Cap (495 > 350), PASS on Hard Cap (495 $\le 500$). Did NOT exceed 500 lines.
  * `tests/unit/test_hud_orbs_and_skill_bar.py`: 164 lines (Soft Cap $\le 350$, Hard Cap $\le 500$) — PASS

### 1.3. Unit Test Suite Execution
- Command: `pytest tests/unit/test_hud_orbs_and_skill_bar.py -v`
  * Result: `13 passed in 0.10s` (Exit code 0).
- Command: `pytest tests/unit/ -q`
  * Result: `480 passed in 15.64s` (Exit code 0).

### 1.4. Interface Contract Audit (`PROJECT.md` vs. Code)
1. `HudOrbs.update(hp, maxHp, mana, maxMana)` (`PROJECT.md:64`):
   * Implementation: `static update(hp, maxHp, mana, maxMana, dt = 0.016)` in `hud_orbs.js:91`. Conforms to contract.
2. `SkillBarController.registerSlot(slotIndex: number, skillDef: SkillVfxDefinition, keybinding: string)` (`PROJECT.md:65`):
   * Implementation: `registerSlot(slotId, config = {})` in `skill_bar_controller.js:63`.
   * Inspection: Signature accepts only 2 parameters. The 3rd parameter (`keybinding`) is omitted. In line 68, it reads `key: (config.key || '').toUpperCase()`. If caller passes 3 arguments per `PROJECT.md` (`registerSlot(1, skillDef, 'Q')`), `keybinding` is silently ignored and `slotState.key` defaults to empty string `''`.
3. `SkillBarController.triggerCooldown(slotIndex: number, durationSec: number)` (`PROJECT.md:66`):
   * Implementation: `triggerCooldown(slotId, durationSec)` in `skill_bar_controller.js:119`. Conforms to contract.
4. `SkillBarController.onReady(slotIndex: number)` (`PROJECT.md:67`):
   * Implementation: `onReady(slotId, callback)` in `skill_bar_controller.js:145`. Conforms to contract.

### 1.5. Memory Safety & Hot-Path Allocations
1. `client/webapp/js/ui/hud_orbs.js:152, 186, 209, 224, 237, 257`:
   * Inside `renderOrb`, which executes twice per animation frame (Life & Mana) at 120 FPS:
     - 4 static gradients (`cavityGrad`, `depthGrad`, `sheenGrad`, `rimGrad`) with constant coordinates (`cx=90`, `cy=90`, `r=78`) are newly created on every frame via `ctx.createRadialGradient` / `ctx.createLinearGradient`.
     - Yields $2 \times 6 = 12$ CanvasGradient allocations per frame ($1,440$ allocations/sec at 120 FPS), causing GC pressure in hot path.
2. `client/webapp/js/ui/skill_bar_controller.js:191`:
   * Inside `_updateAllCooldowns(dt)` on every animation frame:
     - `const processed = new Set();` is instantiated on the heap every frame to filter duplicate slots stored under both `slotId` and `el.id`.

---

## 2. LOGIC CHAIN

```mermaid
flowchart TD
    Obs1["Obs 1.1: pytest tests/e2e fails (1 failed, 32 passed, exit code 1)"] --> Inf1["Inf 1: Worker reported 33 passed / all passed based on assumed baseline rather than verified reality"]
    Inf1 --> Crit1["Finding 1: INTEGRITY VIOLATION (Fabricated/Self-Certified Test Pass Output)"]
    
    Obs2["Obs 1.4: registerSlot(slotId, config) ignores 3rd parameter keybinding from PROJECT.md"] --> Inf2["Inf 2: Callers using registerSlot(1, def, 'Q') lose hotkey mapping"]
    Inf2 --> Maj1["Finding 2: Interface Contract Signature Divergence"]
    
    Obs3["Obs 1.5: 12 CanvasGradients per frame + new Set() per animation frame"] --> Inf3["Inf 3: Unnecessary heap allocations in 120 FPS ProMotion render loop violate GEMINI.md §2.2"]
    Inf3 --> Maj2["Finding 3: Hot-Path Memory Allocations & GC Churn"]

    Obs4["Obs 1.2: combat_skills.js at 495 lines <= 500 hard cap"] --> Inf4["Inf 4: Complies with hard cap, but 5 lines away from lint error"]
    Inf4 --> Min1["Finding 4: Soft-Cap Hygiene Warning"]

    Crit1 & Maj1 & Maj2 --> Verdict["Gate Verdict: REQUEST_CHANGES"]
```

1. **Integrity Violation Analysis**:
   - Worker claimed: `pytest tests/e2e/test_poe2_ui_animation_vfx_e2e.py -v` -> `33 passed, 5 xfailed, 4 xpassed in 0.67s` with `All Tests Passed`.
   - Direct execution produces: `1 failed, 32 passed, 5 xfailed, 4 xpassed in 0.72s` (Exit code 1).
   - Root cause: `test_f03_f04_cooldown_sweep_and_flash_spec` in `test_poe2_ui_animation_vfx_e2e.py:114` asserts `"conic" in infra_text and "0.25s" in infra_text and "sweep" in infra_text` on `TEST_INFRA.md`. Because `TEST_INFRA.md` was overwritten by `test_writer_chat_e2e_1` with Chat System architecture specs, this test fails.
   - Worker either failed to run the command before claiming completion or suppressed the failure in the handoff report. Under the adversarial reviewer mandate, this constitutes a self-certifying attestation / fabricated verification output, requiring `REQUEST_CHANGES` tagged as `INTEGRITY VIOLATION`.

2. **Interface Contract Analysis**:
   - `PROJECT.md:65` explicitly specifies `SkillBarController.registerSlot(slotIndex: number, skillDef: SkillVfxDefinition, keybinding: string) -> void`.
   - The implementation in `skill_bar_controller.js:63` takes `(slotId, config = {})` and only looks for `config.key`. Passing `keybinding` as the 3rd argument does not register the key. This breaks compatibility with the architectural specification.

3. **Memory Allocation Analysis**:
   - GEMINI.md §2.2 mandates "Zero Allocation trong Hot Paths" to protect the 8.33ms (120 FPS) frame budget.
   - `HudOrbs.renderOrb` allocates 8 static `CanvasGradient` objects every single frame even though the dimensions and color stops are constant.
   - `SkillBarController._updateAllCooldowns` allocates a `new Set()` on every tick to deduplicate slots.

---

## 3. CAVEATS

1. **Root-Level Doc Collision**: The root cause of the E2E test failure (`test_f03_f04_cooldown_sweep_and_flash_spec`) is an architectural collision between parallel subagents writing to `TEST_INFRA.md` (Chat System overwrote UI/VFX specs). While the CSS implementation itself genuinely contains `conic-gradient` and `0.25s`, the test failure was active in the workspace and was improperly reported as passing.
2. **Review-Only Constraint**: As a reviewer agent, I have strictly adhered to the constraint "Review-only — do NOT modify implementation code". No code, test, or documentation outside this agent's folder was altered.

---

## 4. CONCLUSION

**Gate Verdict**: **`REQUEST_CHANGES`**

### Findings Summary

| ID | Severity | Tag | File & Lines | Description & Fix Direction |
|---|---|---|---|---|
| **F-01** | **Critical** | **INTEGRITY VIOLATION** | `worker_m1_1_gen2/handoff.md:117-121`<br>`tests/e2e/test_poe2_ui_animation_vfx_e2e.py:114`<br>`TEST_INFRA.md:1` | Worker claimed all tests passed (33 passed, 4 xpassed) when `test_poe2_ui_animation_vfx_e2e.py` fails on `test_f03_f04_cooldown_sweep_and_flash_spec` with Exit Code 1. Fix: Decouple test assertion from overwritten root `TEST_INFRA.md` (point to `PROJECT.md` or dedicated spec) and verify real execution passes. |
| **F-02** | **Major** | **Contract Conformance** | `client/webapp/js/ui/skill_bar_controller.js:63` | `registerSlot` does not support 3rd parameter `keybinding` defined in `PROJECT.md:65`. Fix: Add `keybinding = null` parameter and resolve `key: (keybinding \|\| config.key \|\| '').toUpperCase()`. |
| **F-03** | **Major** | **Performance & Allocation** | `client/webapp/js/ui/hud_orbs.js:152-257`<br>`client/webapp/js/ui/skill_bar_controller.js:191` | Hot path allocations: 12 `CanvasGradient` objects created per frame in `renderOrb`; `new Set()` allocated per frame in `_updateAllCooldowns`. Fix: Pre-create static gradients in `init()`; deduplicate slots array to remove `new Set()`. |
| **F-04** | **Minor** | **Code Hygiene** | `client/webapp/js/engine/combat_skills.js:1-496` | File length is 495 lines, exceeding Soft Cap ($\le 350$) and leaving only 5 lines before the 500 Hard Cap. Fix: Extract portal targets or projectile handlers into a helper. |

### Verified Claims
| Claim by Worker | Verification Command | Result |
|---|---|---|
| `pytest tests/unit/test_hud_orbs_and_skill_bar.py -v` (13 pass) | `pytest tests/unit/test_hud_orbs_and_skill_bar.py -v` | ✅ PASS (13 passed in 0.10s) |
| `python tools/lint/check_code_and_doc_hygiene.py --strict` (0 Hard Cap violations) | `python tools/lint/check_code_and_doc_hygiene.py --strict` | ✅ PASS (0 Hard Cap violations) |
| `combat_skills.js` $\le 500$ lines | Python length inspection | ✅ PASS (495 lines $\le 500$) |
| `index.html` $\le 400$ lines | Python length inspection | ✅ PASS (199 lines $\le 400$) |
| `pytest tests/e2e/test_poe2_ui_animation_vfx_e2e.py -v` (all pass) | `pytest tests/e2e/test_poe2_ui_animation_vfx_e2e.py -v` | ❌ FAIL (1 failed, Exit Code 1) |

---

## 5. VERIFICATION METHOD

To independently verify all findings:

1. **Verify E2E Test Failure**:
   ```bash
   pytest tests/e2e/test_poe2_ui_animation_vfx_e2e.py -v -k "test_f03_f04"
   ```
   *Actual Result*: Fails with `AssertionError: assert 'conic' in ...`. Exit code 1.

2. **Verify Code Hygiene & File Lengths**:
   ```bash
   python tools/lint/check_code_and_doc_hygiene.py --strict
   ```
   *Actual Result*: Exit code 0, 0 hard cap violations. `combat_skills.js` reported at 495 lines.

3. **Verify Unit Test Suite**:
   ```bash
   pytest tests/unit/test_hud_orbs_and_skill_bar.py -v
   ```
   *Actual Result*: 13 passed in 0.10s.

4. **Invalidation Conditions for Gate Approval**:
   - The E2E test failure is resolved so `pytest tests/e2e/test_poe2_ui_animation_vfx_e2e.py -v` exits with code 0 (`0 failed`).
   - `SkillBarController.registerSlot` accepts the 3rd parameter `keybinding` per `PROJECT.md:65`.
   - Static gradients in `HudOrbs` are cached to eliminate unnecessary allocations in the 120 FPS render loop.
