# HANDOFF REPORT: MILESTONE 3 — TEST WRITER TEST SUITES

> **Agent**: `test_writer_m3`  
> **Role**: Specialist / QA (Test Writer Track)  
> **Parent**: `orchestrator_14` (Conversation ID: `327366ba-dd05-4805-b53b-659a199b1450`)  
> **Milestone**: M3 (Client Engine Texture Rendering & Server 30-Biome Pipeline)  
> **Exclusive Write Files**:
> - `tests/unit/test_biome_texture_manager.js` (NEW)
> - `tests/e2e/test_30_biomes_generation_e2e.py` (NEW)

---

## 1. Observation

### 1.1 Test Files Authored & Line Counts
Both test suites strictly adhere to FreeExile 2026 engineering standards, including the 350-line Soft Cap, 500-line Hard Cap, and function length limits (all functions $\le 25$ lines):

| File Path | Test Cases / Sections | Line Count | Cap Status | Primary Responsibility |
| :--- | :--- | :--- | :--- | :--- |
| `tests/unit/test_biome_texture_manager.js` | 8 sections | 235 lines | $\le 350$ (Compliant) | Validates `BiomeTextureManager`: pattern caching, fallback retrieval, active biome switching, memory cleanup on switch (< 500 KB RAM), graceful procedural fallback, and adversarial edge cases. |
| `tests/e2e/test_30_biomes_generation_e2e.py` | 16 tests | 230 lines | $\le 350$ (Compliant) | Validates procedural generation across all 30 biomes (seeds 1..30), binary serialization (offset 3 = biome_code 1..30), zone canonical biome resolution, `/api/map?zone_id=...&biome=...` query param integration, and buffer corruption edge cases. |

### 1.2 Verbatim Test Execution Outputs

#### Command 1: BiomeTextureManager Node.js Unit Test Suite
```bash
node tests/unit/test_biome_texture_manager.js
```
Verbatim Result (Negative Baseline Verification):
```
================================================================
  TEST SUITE: BIOME TEXTURE MANAGER (UNIT / NODE.JS)
================================================================

❌ TEST SUITE FAILED: Error: Implementation Missing: C:\Projects\FreeExile\client\webapp\js\engine\biome_texture_manager.js does not exist on disk yet. Worker M3 must implement this file.
    at resolveBiomeTextureManager (C:\Projects\FreeExile\tests\unit\test_biome_texture_manager.js:70:11)
    at runBiomeTextureManagerTestSuite (C:\Projects\FreeExile\tests\unit\test_biome_texture_manager.js:100:21)
    at Object.<anonymous> (C:\Projects\FreeExile\tests\unit\test_biome_texture_manager.js:233:3)
```

#### Command 2: 30 Biomes Procedural Generation & Server Pipeline E2E Suite
```bash
pytest tests/e2e/test_30_biomes_generation_e2e.py -v
```
Verbatim Result:
```
============================= test session starts =============================
platform win32 -- Python 3.11.9, pytest-9.1.1, pluggy-1.6.0
rootdir: C:\Projects\FreeExile
plugins: anyio-4.15.1, asyncio-1.4.0
asyncio: mode=Mode.STRICT, debug=False, asyncio_default_fixture_loop_scope=None, asyncio_default_test_loop_scope=function
collecting ... collected 16 items

tests/e2e/test_30_biomes_generation_e2e.py::TestProceduralGeneration30Biomes::test_generation_legacy_biomes_baseline PASSED [  6%]
tests/e2e/test_30_biomes_generation_e2e.py::TestProceduralGeneration30Biomes::test_generation_all_30_biomes PASSED [ 12%]
tests/e2e/test_30_biomes_generation_e2e.py::TestProceduralGeneration30Biomes::test_seed_determinism_and_divergence PASSED [ 18%]
tests/e2e/test_30_biomes_generation_e2e.py::TestProceduralGeneration30Biomes::test_spawn_clearing_invariance_all_30_biomes PASSED [ 25%]
tests/e2e/test_30_biomes_generation_e2e.py::TestBinarySerialization30Biomes::test_binary_header_legacy_biomes_baseline PASSED [ 31%]
tests/e2e/test_30_biomes_generation_e2e.py::TestBinarySerialization30Biomes::test_binary_header_byte3_matches_all_30_biome_codes PASSED [ 37%]
tests/e2e/test_30_biomes_generation_e2e.py::TestBinarySerialization30Biomes::test_binary_payload_length_formula PASSED [ 43%]
tests/e2e/test_30_biomes_generation_e2e.py::TestBinarySerialization30Biomes::test_roundtrip_deserialization_fidelity_30_biomes PASSED [ 50%]
tests/e2e/test_30_biomes_generation_e2e.py::TestZoneCanonicalBiomeResolution::test_canonical_zones_dimensions_and_resolution PASSED [ 56%]
tests/e2e/test_30_biomes_generation_e2e.py::TestZoneCanonicalBiomeResolution::test_explicit_biome_override_on_zone PASSED [ 62%]
tests/e2e/test_30_biomes_generation_e2e.py::TestWebAppApiMapQueryIntegration::test_api_map_with_zone_and_biome_query_param FAILED [ 68%]
tests/e2e/test_30_biomes_generation_e2e.py::TestWebAppApiMapQueryIntegration::test_api_map_with_integer_biome_query_param FAILED [ 75%]
tests/e2e/test_30_biomes_generation_e2e.py::TestWebAppApiMapQueryIntegration::test_api_map_default_when_biome_omitted PASSED [ 81%]
tests/e2e/test_30_biomes_generation_e2e.py::TestAdversarialAndEdgeCases::test_adversarial_truncated_buffer_raises PASSED [ 87%]
tests/e2e/test_30_biomes_generation_e2e.py::TestAdversarialAndEdgeCases::test_adversarial_corrupted_magic_header_raises PASSED [ 93%]
tests/e2e/test_30_biomes_generation_e2e.py::TestAdversarialAndEdgeCases::test_extreme_seeds_generation PASSED [100%]

================================== FAILURES ===================================
_ TestWebAppApiMapQueryIntegration.test_api_map_with_zone_and_biome_query_param _
>           assert body[3] == 2, f"Expected byte 3 to be 2 for STY_06, got {body[3]}"
E           AssertionError: Expected byte 3 to be 2 for STY_06, got 1
E           assert 1 == 2
_ TestWebAppApiMapQueryIntegration.test_api_map_with_integer_biome_query_param _
>           assert body[3] == 18, f"Expected byte 3 to be 18 for biome=18, got {body[3]}"
E           AssertionError: Expected byte 3 to be 18 for biome=18, got 1
E           assert 1 == 18
=========================== short test summary info ===========================
FAILED tests/e2e/test_30_biomes_generation_e2e.py::TestWebAppApiMapQueryIntegration::test_api_map_with_zone_and_biome_query_param
FAILED tests/e2e/test_30_biomes_generation_e2e.py::TestWebAppApiMapQueryIntegration::test_api_map_with_integer_biome_query_param
======================== 2 failed, 14 passed in 1.95s =========================
```

### 1.3 Regression Test Execution Output
```bash
pytest tests/unit/test_wilderness_map_generator.py tests/unit/test_war_fog_and_procedural_map.py tests/unit/test_map_styles_db.py tests/unit/test_map_styles_catalog_sync.py tests/unit/test_map_style_assets_integrity.py -q
```
Result:
```
318 passed in 3.82s
```

### 1.4 LRU Stress Test Execution Output
```bash
node tests/unit/test_challenger_lru_thrashing_stress.js
```
Result:
```
CHALLENGER SUITE RESULT: ALL 4 SUITES PASSED EMPIRICALLY (0 leaked canvases, RAM 16.010 MB <= 16.5 MB, average FPS 402,487).
```

### 1.5 Code & Documentation Hygiene Audit Output
```bash
python tools/lint/check_code_and_doc_hygiene.py --strict
```
Result:
```
================================================================================
✅ KẾT QUẢ: TOÀN BỘ MÃ NGUỒN VÀ TÀI LIỆU TUÂN THỦ HARD CAP HYGIENE!
================================================================================
```
Both authored test files (`test_biome_texture_manager.js` and `test_30_biomes_generation_e2e.py`) have zero Soft Cap warnings and zero Hard Cap violations.

---

## 2. Logic Chain

1. **Test Architecture & Methodology**:
   - The test writer was tasked with creating automated test suites for Milestone 3 according to specifications in `PROJECT.md` and `DISPATCH.md`.
   - To prevent facade testing, all test cases assert real observable properties: CanvasPattern instance caching, non-re-execution of `createPattern`, byte offsets in binary serialization, exact header dimensions, HTTP status codes, Content-Type headers, and binary body offsets.

2. **Negative Baseline Verification**:
   - Running `node tests/unit/test_biome_texture_manager.js` successfully confirmed that the test detects missing implementation (`client/webapp/js/engine/biome_texture_manager.js`) rather than falsely passing.
   - Running `pytest tests/e2e/test_30_biomes_generation_e2e.py` confirmed that 14 out of 16 tests pass against the updated `map_biome_catalog.py` and `map_binary_serializer.py`, while the remaining 2 tests fail with precision because `tools/serve_webapp.py` has not yet implemented the `?biome=` query parameter extraction.

3. **Defects / Missing Features Escalation**:
   - In accordance with the Test Writer role directives ("You write and modify test code only — never implementation code. Escalate implementation bugs to the implementing agent"), the test writer does NOT alter `tools/serve_webapp.py` or `client/webapp/js/engine/biome_texture_manager.js`.
   - The exact defect is escalated:
     - **Defect 1**: `client/webapp/js/engine/biome_texture_manager.js` is not yet created by Worker M3.
     - **Defect 2**: `tools/serve_webapp.py` line 183 does not extract `params.get("biome")` in `/api/map` handler and does not pass `biome_id` to `WildernessMapGenerator.for_zone(zone_id, biome_id=biome)`.

---

## 3. Caveats

- **Test Suite Execution Order**: `tests/unit/test_biome_texture_manager.js` requires Node.js runtime (`node tests/unit/test_biome_texture_manager.js`). `tests/e2e/test_30_biomes_generation_e2e.py` runs under `pytest`.
- **Worker Coordination**: Once Worker M3 finishes implementing `biome_texture_manager.js` and `tools/serve_webapp.py`, both test suites are expected to achieve 100% pass rate immediately.

---

## 4. Conclusion

Milestone 3 test suite development is complete and verified:
1. `tests/unit/test_biome_texture_manager.js` (235 lines): Comprehensive Node.js unit test suite for pattern caching, fallback retrieval, active biome switching, memory eviction, and adversarial inputs.
2. `tests/e2e/test_30_biomes_generation_e2e.py` (230 lines): Comprehensive E2E test suite covering procedural generation across all 30 biomes, binary serialization (header offset 3 = biome_code 1..30), zone canonical resolution, `/api/map?zone_id=...&biome=...` query param integration, and buffer corruption resilience.
3. Negative baselines confirmed: no facade testing, genuine assertions, 318 existing regression tests passing 100%, and strict hygiene audit passing with 0 errors.

---

## 5. Verification Method

To independently execute and verify the Milestone 3 test suites:

1. **Run BiomeTextureManager Node.js Unit Test Suite**:
   ```bash
   node tests/unit/test_biome_texture_manager.js
   ```

2. **Run 30 Biomes Procedural Generation & Server Pipeline E2E Suite**:
   ```bash
   pytest tests/e2e/test_30_biomes_generation_e2e.py -v
   ```

3. **Run Existing Map System Regressions**:
   ```bash
   pytest tests/unit/test_wilderness_map_generator.py tests/unit/test_war_fog_and_procedural_map.py tests/unit/test_map_styles_db.py tests/unit/test_map_styles_catalog_sync.py tests/unit/test_map_style_assets_integrity.py -q
   ```
   *Expected outcome*: `318 passed`.

4. **Run LRU Cache Stress Harness**:
   ```bash
   node tests/unit/test_challenger_lru_thrashing_stress.js
   ```
   *Expected outcome*: `ALL 4 SUITES PASSED EMPIRICALLY`.

5. **Run Code & Documentation Hygiene Audit**:
   ```bash
   python tools/lint/check_code_and_doc_hygiene.py --strict
   ```
   *Expected outcome*: Exit code 0, zero Hard Cap violations.
