# VICTORY AUDIT REPORT

**Auditor**: `victory_auditor_6` (Independent Victory Auditor)  
**Parent Agent**: `parent` (`b807e7b3-de09-4f95-ae2c-42e5e8a03ab6`)  
**Target Orchestrator**: `orchestrator_13` (`c:\Projects\FreeExile\.agents\teamwork\orchestrator_13`)  
**Authoritative Request**: `ORIGINAL_REQUEST.md` (Section `## 2026-10-02T01:42:06Z`)  
**Timestamp**: 2026-10-02T03:17:00Z  

```
=== VICTORY AUDIT REPORT ===

VERDICT: VICTORY REJECTED

PHASE A — TIMELINE:
  Result: PASS
  Anomalies: none

PHASE B — INTEGRITY CHECK:
  Result: PASS
  Details: Zero facade implementations, zero fake mocks, zero hardcoded test outputs. Chat UI contains zero unlocalized Vietnamese rendering strings (all occurrences are allowlisted fallback parameters or seed constants). 100% 9-language key parity verified for all 77 keys in chat_i18n_catalog.js matching GLOBAL_LOCALIZATION_DICTIONARY.md.

PHASE C — INDEPENDENT TEST EXECUTION:
  Test command: pytest tests/unit/test_i18n_event_bus.py tests/e2e/test_i18n_reactive_switching_e2e.py tests/unit/test_challenger_i18n_reactive_chat.py tests/unit/test_challenger_i18n_m1_parity.py -v && python tools/lint/check_code_and_doc_hygiene.py --strict
  Your results: 4 out of 6 test suites/checks FAILED.
    1. tools/lint/check_i18n_hygiene.py --strict: PASS (0 violations)
    2. tools/lint/check_code_and_doc_hygiene.py --strict: FAIL (Exit code 1, tools/knowledge/combat_room_sync.py 531 lines > 500 hard cap)
    3. tests/unit/test_i18n_event_bus.py: FAIL (23 errors, SyntaxError: missing ) after argument list in client/webapp/js/data/i18n.js:280)
    4. tests/e2e/test_i18n_reactive_switching_e2e.py: FAIL (1 failure, AssertionError: 'Thế Giới' != 'World' due to syntax error preventing i18n initialization)
    5. tests/unit/test_challenger_i18n_reactive_chat.py & test_challenger_i18n_m1_parity.py: FAIL (13 failed, 10 passed due to syntax error in i18n.js)
    6. tools/security/run_independent_security_audit.py: PASS (0 Critical, 0 High vulnerabilities)
  Claimed results: 185/185 tests green, linters exit code 0, security gate passed.
  Match: NO — Discrepancies in tests 2, 3, 4, and 5.

EVIDENCE (if REJECTED):
  1. Syntax Error in client/webapp/js/data/i18n.js:
     Node.js output:
     C:\Projects\FreeExile\client\webapp\js\data\i18n.js:280
       }
       ^
     SyntaxError: missing ) after argument list
     Caused by line 269:
       root.querySelectorAll('[data-i18n-tooltip-desc]').forEach(el => {
         if (key) el.dataset.tooltipDesc = this.t(key);
       // Missing closing '});' before line 271

  2. Hard Cap Hygiene Failure:
     tools/lint/check_code_and_doc_hygiene.py output:
     ❌ [CODE] tools\knowledge\combat_room_sync.py (531 dòng) -> Vượt quá Hard Cap (531 > 500 dòng). Bắt buộc tách module, catalog hoặc DTOs!
     ❌ KẾT QUẢ: PHÁT HIỆN FILE VI PHẠM QUY CHUẨN ĐỘ DÀI & MODULE HÓA!
```

---

## 1. Detailed Phase A Findings: Timeline & Provenance Audit
- **Reconstruction**: Verified progressive development through Milestones 0 to 4:
  - M1: `worker_m1_1` (02:10:40Z), `reviewer_i18n_m1_1` (02:16:09Z), `reviewer_i18n_m1_2` (02:20:07Z), `challenger_i18n_m1_1` (02:19:16Z), `challenger_i18n_m1_2` (02:19:28Z), `auditor_i18n_m1_1` (02:16:43Z).
  - M2: `worker_m2_1` (02:37:52Z), `reviewer_i18n_m2_2` (02:41:52Z), `auditor_i18n_m2_1` (02:42:43Z), `reviewer_i18n_m2_1` (02:44:28Z), `challenger_i18n_m2_2` (02:45:06Z), `challenger_i18n_m2_1` (02:45:54Z).
  - M3: `worker_m3_1` (02:55:34Z).
  - M4: `reviewer_final_m4` (03:03:57Z), `auditor_final_m4` (03:07:31Z).
  - Orchestrator 13 Claim: 03:09:00Z.
- **Provenance**: All handoff reports exist, adhere to the 5-component handoff protocol, and contain concrete tool execution logs.
- **Anomalies**: None detected during Orchestrator 13's development execution.

---

## 2. Detailed Phase B Findings: Integrity & Anti-Cheating Forensics
- **Facade Detection**:
  - `client/webapp/js/data/i18n.js`: Genuine observer pub/sub pattern implementation, CustomEvent dispatching, fallback hierarchy chaining (`curDict -> enDict -> viDict -> fallback -> key`), dynamic parameter interpolation. Zero dummy facades.
  - `client/webapp/js/ui/chat_ui.js`: Atomic in-place dynamic re-rendering of all 8 channel tabs, input placeholder, send button, cooldown badge, chat history, and open item link tooltip modal.
- **Hardcoded Vietnamese String Audit in `chat_ui.js`**:
  - Exactly 30 lines contain Vietnamese characters:
    - 1 line: Header comment
    - 7 lines: Default seed definitions (`CHANNELS`, `RARITY_INFO`, `ELEMENT_NAMES`)
    - 22 lines: 3rd-argument fallback strings to `t('key', params, fallback)`
    - 0 lines: Direct unlocalized text assignments to UI DOM elements.
- **9-Language Parity Audit in `chat_i18n_catalog.js`**:
  - Exactly 77 keys present across all 9 languages: `vi`, `en`, `zh`, `ja`, `ko`, `th`, `de`, `ru`, `es`.
  - Node evaluation verified 100% symmetric parity.
  - Cross-checked against `docs/standards/GLOBAL_LOCALIZATION_DICTIONARY.md` Section 13: 0 missing keys.

---

## 3. Detailed Phase C Findings: Independent Test Execution
Independent execution of the canonical test suite on the current workspace produced the following results:

1. `python tools/lint/check_i18n_hygiene.py --strict`:
   - **Result**: PASS (Exit code 0).
   - Rule 1 Violations: 0, Rule 2 Violations: 0, Rule 3 Violations: 0.

2. `python tools/lint/check_code_and_doc_hygiene.py --strict`:
   - **Result**: FAIL (Exit code 1).
   - Violation: `tools\knowledge\combat_room_sync.py` has 531 lines, exceeding `CODE_HARD_CAP` of 500 lines.

3. `pytest tests/unit/test_i18n_event_bus.py -v`:
   - **Result**: FAIL (23 errors out of 23 tests, Exit code 1).
   - Stacktrace:
     ```
     RuntimeError: Node execution failed (code 1):
     C:\Projects\FreeExile\client\webapp\js\data\i18n.js:280
       }
       ^
     SyntaxError: missing ) after argument list
     ```

4. `pytest tests/e2e/test_i18n_reactive_switching_e2e.py -v`:
   - **Result**: FAIL (1 failure out of 1 test, Exit code 1).
   - Assertion: `AssertionError: 'Thế Giới' != 'World'` because `i18n.js` failed to evaluate in the browser, preventing locale changes.

5. `pytest tests/unit/test_challenger_i18n_reactive_chat.py tests/unit/test_challenger_i18n_m1_parity.py -v`:
   - **Result**: FAIL (13 failed, 10 passed, Exit code 1) due to the same `SyntaxError` in `i18n.js`.

6. `python tools/security/run_independent_security_audit.py --build-id "RELEASE-I18N-2026" --env STAGING`:
   - **Result**: PASS (0 Critical, 0 High vulnerabilities, Exit code 0).

7. **Documentation Compliance**:
   - `docs/standards/ENGINEERING_STANDARDS_2026.md`: Section 3.6 fully documented (390 lines $\le 400$ soft cap).
   - `AGENTS.md`: Protocol 14 and Rule 5 present (144 lines $\le 400$ soft cap).
   - `GEMINI.md`: Directive 5 and Section 2.13 present (210 lines $\le 400$ soft cap).

---

## 4. Root Cause Analysis
1. **Uncommitted Workspace & Git Worktree Isolation Violation**:
   `orchestrator_13` completed its verification at 03:09:00Z but did not commit its changes to git. The changes were left uncommitted in the main working tree.
2. **Concurrent Mutation**:
   At `2026-10-02T03:12:13Z`, another subagent (`worker_m5`), operating concurrently in the shared workspace instead of an isolated Git worktree (`Workspace: 'branch'`), modified `client/webapp/js/data/i18n.js` to insert `PARTY_SOCIAL_I18N_CATALOG`. In doing so, it deleted the closing `});` of `querySelectorAll('[data-i18n-tooltip-desc]').forEach(...)` at line 270, corrupting `i18n.js` with a fatal `SyntaxError`.
3. **Hygiene Contamination**:
   At `2026-10-02T03:10:36Z`, an external script `tools/knowledge/combat_room_sync.py` (531 lines) was written to disk, which breaks `check_code_and_doc_hygiene.py --strict`.

Under the governing Victory Audit directive:
> *"The only unforgeable proof of execution is independent execution... Report any failures as findings — do NOT fix them yourself."*

Because the auditor is strictly forbidden from editing implementation code, and because independent execution of the test suite on the actual workspace currently fails, the audit verdict must be:
**`VICTORY REJECTED`**.

## 5. Required Remediations for Release Certification
1. Restore the missing `});` in `client/webapp/js/data/i18n.js` line 270 to resolve the `SyntaxError`.
2. Modularize or shorten `tools/knowledge/combat_room_sync.py` so that it stays $\le 500$ lines.
3. Commit the cleaned codebase to git (`git commit`) to protect against concurrent workspace contamination.
4. Re-run the full verification battery and request a clean Victory Re-Audit.
