# FORENSIC AUDIT REPORT: MILESTONE M2 (ARCHIVAL & WORKSPACE HYGIENE)

> **Agent**: Forensic Auditor (`auditor_m2_1`)  
> **Parent Orchestrator**: `97faf5e5-a830-491c-b78c-2af12175badf`  
> **Milestone**: M2 - Archival & Workspace Hygiene  
> **Audited Work Product**: Deliverables of `worker_m2_hygiene_1`  
> **Working Directory**: `c:\Projects\KieuStory\.agents\teamwork\auditor_m2_1`  
> **Timestamp**: 2026-10-09T03:08:00Z  
> **Profile**: General Project (Development Mode)  
> **BINARY VERDICT**: **VERDICT: INTEGRITY VIOLATION**

---

## 1. EXECUTIVE SUMMARY & VERDICT

**VERDICT: INTEGRITY VIOLATION**

The work product submitted by `worker_m2_hygiene_1` for Milestone M2 is rejected due to a critical integrity failure:
1. **Unfulfilled Purge Requirement**: Keyframe directory `c:\Projects\KieuStory\04_Assets\keyframes\ep01_scene10_shot14` was left on disk (or created prior to handoff and never cleaned up).
2. **False Attestation / Test Failure**: `worker_m2_hygiene_1` attested in `handoff.md` (lines 48, 59-60, 99) that 100% of Ep01 keyframe directories were purged and that `pytest tests/test_m2_hygiene.py -v` passed cleanly (6 passed in 0.20s). Independent empirical verification reveals this test suite **actively fails** on `test_keyframes_ep01_purged` with `AssertionError: Expected 0 Ep01 keyframe directories remaining in C:\Projects\KieuStory\04_Assets\keyframes, found 1: ['ep01_scene10_shot14']`.

Under the Forensic Audit charter: *"If ANY check fails, your verdict is INTEGRITY VIOLATION and you MUST reject the work product."*

---

## 2. PHASE RESULTS MATRIX

| # | Forensic Verification Check | Scope | Result | Evidence Summary |
|---|-----------------------------|-------|:------:|------------------|
| 1 | **Video File Authenticity** | `04_Assets/archive/ep01_legacy_v1/` | **PASS** | Exactly 184 `.mp4` files, total size 2,249,030,734 bytes (2.095 GB) > 2.0 GB. All 184 files possess valid ISO/IEC 14496 `ftyp` headers at byte offset 4. Zero dummy/0-byte files. |
| 2 | **IP Legal Documentation Authoring** | `04_Assets/archive/ep01_legacy_v1/README.md` | **PASS** | 9,931 bytes (>1,000 required). Genuinely authored, cites Vietnamese IP Law Articles 4(8), 14, 20, 43, author credentials (CCCD: 031090010018), Human-in-the-Loop creative evidence, root cause technical rationale, and complete 184-video inventory breakdown. |
| 3 | **Character Invariant Preservation** | `04_Assets/characters/` | **PASS** | All 14 core Ep01 character portraits exist, load without error via PIL, match exact 720p/master dimensions, non-empty (>1 MB). Total 62 character files intact. |
| 4 | **Non-Ep01 Asset Invariant Preservation** | `04_Assets/videos/`, `keyframes/` | **PASS** | 118 non-Ep01 videos intact; 67 non-Ep01 keyframe directories intact; 10 keyframe root files intact. |
| 5 | **Test Suite Authenticity** | `tests/test_m2_hygiene.py` | **PASS** | Genuine unmocked assertions inspecting real filesystem paths. Zero mock facades, monkeypatching, or bypasses. |
| 6 | **Keyframe Purge Verification** | `04_Assets/keyframes/` | **FAIL** | Directory `04_Assets/keyframes/ep01_scene10_shot14` exists on disk (ctime: `2026-10-09 02:53:40 UTC`). Purge requirement violated. |
| 7 | **Independent Test Execution** | `tests/test_m2_hygiene.py` | **FAIL** | `test_keyframes_ep01_purged` raises `AssertionError: Expected 0 Ep01 keyframe directories remaining... found 1: ['ep01_scene10_shot14']`. Exit code 1. |
| 8 | **Attestation Authenticity** | `worker_m2_hygiene_1/handoff.md` | **FAIL** | Worker claimed 6/6 tests passed in 0.20s and 0 Ep01 keyframe directories remaining. Disproven by empirical execution. |

---

## 3. 5-COMPONENT HANDOFF AUDIT REPORT

### 3.1. OBSERVATION

1. **Physical Video Files in Archive (`04_Assets/archive/ep01_legacy_v1/`)**:
   - Total files in archive root: 185 (184 `.mp4` video files + 1 `README.md`).
   - Total `.mp4` aggregate size: **2,249,030,734 bytes (2.095 GB)**.
   - Minimum file size: `1,148,126 bytes` (`ep01_transition_scene01_to_02_2s.mp4`).
   - Maximum file size: `163,330,499 bytes` (`ep01_scene01_master_v1.mp4`).
   - Average file size: `12,222,993 bytes` (~12.2 MB).
   - Binary header inspection across all 184 files:
     ```python
     # Python header check: header[4:8] == b'ftyp'
     # Result: 184/184 valid ftyp signatures, 0 invalid files.
     ```

2. **IP Documentation (`04_Assets/archive/ep01_legacy_v1/README.md`)**:
   - File size: **9,931 bytes** (> 1,000 bytes required).
   - Author credentials verbatim: `"NGUYỄN SĨ SƠN"`, `"031090010018"`, `"08/08/1990"`.
   - Legal statutory citations verbatim: `"Điều 4 khoản 8"`, `"Điều 14"`, `"Điều 20"`, `"Điều 43"`.
   - Literary origin verbatim: `"Đoạn Trường Tân Thanh"`, `"Nguyễn Du (1765 - 1820)"`.
   - Technical & Human-in-the-Loop justification: Explains facial morphing / character leakage caused by blind `clean_frame_239.jpg` chaining in v1, details 2-tier critic gate upgrade, and provides exact inventory of 26 master scene cuts, 152 10s raw shots, and 6 transition cuts.

3. **Character Assets Baseline & Invariant Preservation (`04_Assets/characters/`)**:
   - Exactly 62 files across 7 subdirectories.
   - All 14 core portraits verified with PIL:
     * `01_Main_Protagonists/thuy_kieu_maiden_16yo_720p.png`: PNG, 1280x720, 1,268,162 bytes
     * `01_Main_Protagonists/thuy_kieu_maiden_16yo_master.png`: PNG, 1376x768, 1,360,639 bytes
     * `01_Main_Protagonists/thuy_van_maiden_16yo_720p.png`: PNG, 1280x720, 1,174,746 bytes
     * `01_Main_Protagonists/thuy_van_maiden_16yo_master.png`: PNG, 1376x768, 1,267,719 bytes
     * `01_Main_Protagonists/kim_trong_18yo_720p.png`: PNG, 1280x720, 1,542,062 bytes
     * `01_Main_Protagonists/kim_trong_18yo_master.png`: PNG, 1376x768, 1,703,967 bytes
     * `02_Vuong_Family_And_Fate/vuong_quan_16yo_720p.png`: PNG, 1280x720, 1,453,892 bytes
     * `02_Vuong_Family_And_Fate/vuong_quan_16yo_master.png`: PNG, 1376x768, 1,606,204 bytes
     * `02_Vuong_Family_And_Fate/vuong_ong_55yo_720p.png`: PNG, 1280x720, 1,298,592 bytes
     * `02_Vuong_Family_And_Fate/vuong_ong_55yo_master.png`: PNG, 1376x768, 1,424,147 bytes
     * `02_Vuong_Family_And_Fate/vuong_ba_50yo_720p.png`: PNG, 1280x720, 1,500,547 bytes
     * `02_Vuong_Family_And_Fate/vuong_ba_50yo_master.png`: PNG, 1376x768, 1,669,287 bytes
     * `02_Vuong_Family_And_Fate/dam_tien_720p.png`: PNG, 1280x720, 1,508,473 bytes
     * `02_Vuong_Family_And_Fate/dam_tien_master.png`: PNG, 1376x768, 1,637,223 bytes

4. **Keyframe Directory Purge Failure (`04_Assets/keyframes/`)**:
   - Root file `ep01_scene03_start_720p.png` was deleted.
   - However, directory `04_Assets/keyframes/ep01_scene10_shot14` **still exists on disk**:
     * Absolute path: `c:\Projects\KieuStory\04_Assets\keyframes\ep01_scene10_shot14`
     * Creation time: `2026-10-09 02:53:40.458 UTC`
     * Modification time: `2026-10-09 02:53:40.458 UTC`
     * Contents: empty directory `[]`.
   - Total directories in `04_Assets/keyframes/`: 68 directories (67 non-Ep01 directories + 1 Ep01 directory: `ep01_scene10_shot14`).

5. **Independent Execution of `tests/test_m2_hygiene.py`**:
   - Command: `python -m pytest tests/test_m2_hygiene.py -v`
   - Verbatim console failure output:
     ```
     ============================= test session starts =============================
     platform win32 -- Python 3.11.9, pytest-9.1.1, pluggy-1.6.0
     rootdir: C:\Projects\KieuStory
     collected 6 items

     tests/test_m2_hygiene.py::test_archive_ep01_video_count PASSED           [ 16%]
     tests/test_m2_hygiene.py::test_videos_ep01_purged PASSED                 [ 33%]
     tests/test_m2_hygiene.py::test_keyframes_ep01_purged FAILED              [ 50%]
     tests/test_m2_hygiene.py::test_archive_readme_legal_documentation PASSED [ 66%]
     tests/test_m2_hygiene.py::test_character_portraits_unharmed PASSED       [ 83%]
     tests/test_m2_hygiene.py::test_non_ep01_assets_unharmed PASSED           [100%]

     ================================== FAILURES ===================================
     _________________________ test_keyframes_ep01_purged __________________________

         def test_keyframes_ep01_purged():
             """Assert 0 directories starting with 'ep01' remaining in 04_Assets/keyframes/ and root file removed."""
             assert KEYFRAMES_DIR.exists(), f"Keyframes directory does not exist: {KEYFRAMES_DIR}"
         
             ep01_dirs = [
                 d for d in os.listdir(KEYFRAMES_DIR)
                 if (KEYFRAMES_DIR / d).is_dir() and d.lower().startswith("ep01")
             ]
     >       assert len(ep01_dirs) == 0, (
                 f"Expected 0 Ep01 keyframe directories remaining in {KEYFRAMES_DIR}, found {len(ep01_dirs)}: {ep01_dirs[:5]}"
             )
     E       AssertionError: Expected 0 Ep01 keyframe directories remaining in C:\Projects\KieuStory\04_Assets\keyframes, found 1: ['ep01_scene10_shot14']
     E       assert 1 == 0
     E        +  where 1 = len(['ep01_scene10_shot14'])

     tests\test_m2_hygiene.py:82: AssertionError
     =========================== short test summary info ===========================
     FAILED tests/test_m2_hygiene.py::test_keyframes_ep01_purged - AssertionError: Expected 0 Ep01 keyframe directories remaining in C:\Projects\KieuStory\04_Assets\keyframes, found 1: ['ep01_scene10_shot14']
     ========================= 1 failed, 5 passed in 0.29s =========================
     ```

6. **Worker Handoff Attestation Discrepancy**:
   - `worker_m2_hygiene_1/handoff.md` stated:
     * Line 48: *"Post-purge count: exactly 0 `ep01` directories remaining, exactly 67 non-Ep01 directories remaining"*
     * Line 59: *"`pytest tests/test_m2_hygiene.py -v`: **6 passed in 0.20s**"*
     * Line 60: *"`python tests/test_m2_hygiene.py`: **6 passed in 0.12s**"*
     * Line 99: *"Keyframes: `04_Assets/keyframes/` contains 0 Ep01 directories and 67 non-Ep01 directories."*
   - Timeline analysis shows:
     * `tests/test_m2_hygiene.py` authored at `02:52:41 UTC`.
     * `pytest` cached bytecode generated at `02:52:50 UTC`.
     * `04_Assets/keyframes/ep01_scene10_shot14` creation timestamp is `02:53:40 UTC`.
     * Worker finalized `handoff.md` at `02:54:48 UTC`.
   - The worker did not re-verify the filesystem or re-run the test suite prior to submitting its handoff report, presenting an invalid passing attestation.

---

### 3.2. LOGIC CHAIN

1. **From Observation 1 & 2 to Real Media & IP Evidence**:
   - The 184 video files moved to `04_Assets/archive/ep01_legacy_v1/` are genuine media files totaling 2.25 GB with valid `ftyp` headers.
   - `README.md` is an authentic, thorough 9,931-byte document satisfying all statutory and narrative requirements.
   - There was no fabrication of video files or placeholder documentation.

2. **From Observation 4 & 5 to Objective Test Failure**:
   - Requirement §R2 of `ORIGINAL_REQUEST.md` and Acceptance Criteria state: *"Thư mục 04_Assets/keyframes/ep01_*/ được dọn sạch toàn bộ frame lỗi cũ"*.
   - Because `04_Assets/keyframes/ep01_scene10_shot14` exists on disk, the condition `len(ep01_dirs) == 0` evaluated to `False` (`1 == 0`).
   - The test `test_keyframes_ep01_purged` threw an unhandled `AssertionError`, causing the test runner to exit with non-zero failure code.

3. **From Observation 6 to Integrity Violation Finding**:
   - The worker submitted a formal handoff claiming 100% completion and 6/6 test pass.
   - In reality, the physical disk contained an unpurged Ep01 directory and the test failed.
   - Under the Forensic Audit standard, certifying passing status for a failing deliverable constitutes an **attestation discrepancy / integrity violation**.
   - Consequently, the work product cannot be certified as CLEAN.

---

### 3.3. CAVEATS

1. **Pre-production Re-renders during Audit**:
   - During the audit period, active processes generated new test video files `04_Assets/videos/ep01_scene01_shot01_10s_v1.mp4` and `ep01_scene01_shot02_10s_v1.mp4`, and corresponding keyframes `ep01_scene01_shot01` and `ep01_scene01_shot02`.
   - This audit isolated `ep01_scene10_shot14` (timestamp `02:53:40 UTC`), which directly predated Worker 1's handoff (`02:54:48 UTC`), as the root defect attributable to Milestone M2.
2. **Nested `exports/` Directory**:
   - An unannounced directory `04_Assets/archive/ep01_legacy_v1/exports` containing 17 `.mp4` files exists. While not failing the top-level test, it should be formally tracked or consolidated.

---

### 3.4. CONCLUSION

Milestone M2 (Archival & Workspace Hygiene) is **REJECTED** with **VERDICT: INTEGRITY VIOLATION**.

While video archival and character portrait protection were authentically accomplished, the workspace hygiene purge was incomplete on disk, causing the authoritative test suite `tests/test_m2_hygiene.py` to fail empirically on `test_keyframes_ep01_purged`. The worker's attestation of a clean 6/6 pass was factually inaccurate.

**Required Remediation before Gate Approval**:
1. Purge `c:\Projects\KieuStory\04_Assets\keyframes\ep01_scene10_shot14` (and any other unapproved keyframe remnants).
2. Ensure active pipeline scripts do not leave empty keyframe directories prior to actual render execution.
3. Re-run `python -m pytest tests/test_m2_hygiene.py -v` and confirm 100% genuine 6/6 pass.
4. Issue an updated handoff with verified empirical test output.

---

### 3.5. VERIFICATION METHOD

To independently reproduce this forensic finding:

1. **Inspect leftover keyframe directory**:
   ```powershell
   python -c "import os; p=r'04_Assets/keyframes/ep01_scene10_shot14'; print('Exists:', os.path.exists(p), 'Dirs starting with ep01:', [d for d in os.listdir('04_Assets/keyframes') if d.startswith('ep01')])"
   ```
   *Actual output*: `Exists: True`, contains `ep01_scene10_shot14`.

2. **Execute hygiene test suite directly**:
   ```powershell
   python -m pytest tests/test_m2_hygiene.py -v -k "test_keyframes_ep01_purged"
   ```
   *Actual output*: `FAILED tests/test_m2_hygiene.py::test_keyframes_ep01_purged - AssertionError: Expected 0 Ep01 keyframe directories remaining... found 1: ['ep01_scene10_shot14']`.
