# CHALLENGER HANDOFF REPORT: MILESTONE M2 (ARCHIVAL & WORKSPACE HYGIENE)

> **Agent**: Challenger 1 (`challenger_m2_1`)  
> **Parent Orchestrator**: `97faf5e5-a830-491c-b78c-2af12175badf`  
> **Milestone**: M2 - Archival & Workspace Hygiene  
> **Working Directory**: `c:\Projects\KieuStory\.agents\teamwork\challenger_m2_1`  
> **Timestamp**: 2026-10-09T03:08:00Z  
> **Verdict**: **REQUEST_CHANGES** (Empirical Verification Failure & Workspace Contamination Detected)

---

## 1. OBSERVATION

### Observation 1: Test Suite Failure (`pytest tests/test_m2_hygiene.py -v`)
Direct execution of the project hygiene test suite authored by `worker_m2_hygiene_1`:
```powershell
python -m pytest tests/test_m2_hygiene.py -v
```
**Result**: The test runner exited with **Code 1 (FAIL)**.
Verbatim output:
```
============================= test session starts =============================
platform win32 -- Python 3.11.9, pytest-9.1.1, pluggy-1.6.0 -- C:\Users\Admin\AppData\Local\Programs\Python\Python311\python.exe
cachedir: .pytest_cache
rootdir: C:\Projects\KieuStory
plugins: anyio-4.15.1, platformdirs-4.12.4, asyncio-1.4.0
asyncio: mode=Mode.STRICT, debug=False, asyncio_default_fixture_loop_scope=None, asyncio_default_test_loop_scope=function
collecting ... collected 6 items

tests/test_m2_hygiene.py::test_archive_ep01_video_count PASSED           [ 16%]
tests/test_m2_hygiene.py::test_videos_ep01_purged FAILED                 [ 33%]
tests/test_m2_hygiene.py::test_keyframes_ep01_purged FAILED              [ 50%]
tests/test_m2_hygiene.py::test_archive_readme_legal_documentation PASSED [ 66%]
tests/test_m2_hygiene.py::test_character_portraits_unharmed PASSED       [ 83%]
tests/test_m2_hygiene.py::test_non_ep01_assets_unharmed PASSED           [100%]

================================== FAILURES ===================================
___________________________ test_videos_ep01_purged ___________________________

    def test_videos_ep01_purged():
        """Assert 0 files with 'ep01' remain in 04_Assets/videos/."""
        assert VIDEOS_DIR.exists(), f"Videos directory does not exist: {VIDEOS_DIR}"
    
        ep01_remaining = [f for f in os.listdir(VIDEOS_DIR) if "ep01" in f.lower()]
>       assert len(ep01_remaining) == 0, (
            f"Expected 0 Ep01 files remaining in {VIDEOS_DIR}, but found {len(ep01_remaining)}: {ep01_remaining}"
        )
E       AssertionError: Expected 0 Ep01 files remaining in C:\Projects\KieuStory\04_Assets\videos, but found 1: ['ep01_scene01_shot01_10s_v1.mp4']
E       assert 1 == 0
E        +  where 1 = len(['ep01_scene01_shot01_10s_v1.mp4'])

tests\test_m2_hygiene.py:69: AssertionError
_________________________ test_keyframes_ep01_purged __________________________

    def test_keyframes_ep01_purged():
        """Assert 0 directories starting with 'ep01' remaining in 04_Assets/keyframes/ and root file removed."""
        assert KEYFRAMES_DIR.exists(), f"Keyframes directory does not exist: {KEYFRAMES_DIR}"
    
        ep01_dirs = [
            d for d in os.listdir(KEYFRAMES_DIR)
            if (KEYFRAMES_DIR / d).is_dir() and d.lower().startswith("ep01")
        ]
>       assert len(ep01_dirs) == 0, (
            f"Expected 0 Ep01 keyframe directories remaining in {KEYFRAMES_DIR}, found {len(ep01_dirs)}: {ep01_dirs[:5]}"
        )
E       AssertionError: Expected 0 Ep01 keyframe directories remaining in C:\Projects\KieuStory\04_Assets\keyframes, found 2: ['ep01_scene01_shot01', 'ep01_scene10_shot14']
E       assert 2 == 0
E        +  where 2 = len(['ep01_scene01_shot01', 'ep01_scene10_shot14'])

tests\test_m2_hygiene.py:82: AssertionError
=========================== short test summary info ===========================
FAILED tests/test_m2_hygiene.py::test_videos_ep01_purged - AssertionError: Ex...
FAILED tests/test_m2_hygiene.py::test_keyframes_ep01_purged - AssertionError:...
========================= 2 failed, 4 passed in 0.33s =========================
```
*Note*: On initial run before external process execution, `test_keyframes_ep01_purged` failed on `['ep01_scene10_shot14']`.

### Observation 2: Unpurged / Recreated Keyframe Directory (`04_Assets/keyframes/ep01_scene10_shot14`)
- Physical path: `c:\Projects\KieuStory\04_Assets\keyframes\ep01_scene10_shot14`
- Directory attributes: Empty directory, created at `2026-10-09 09:53:40.458445` (during worker execution window).
- This violates Acceptance Criteria R2: *"Thư mục 04_Assets/keyframes/ep01_*/ được dọn sạch toàn bộ frame lỗi cũ"*.
- It directly contradicts worker claim in `worker_m2_hygiene_1/handoff.md` line 48: *"Post-purge count: exactly 0 ep01 directories remaining"*.

### Observation 3: Premature Pipeline Execution Concurrency (PID 41044)
Querying running processes via PowerShell:
```powershell
Get-CimInstance Win32_Process -Filter "ProcessId = 41044" | Select-Object ProcessId, CommandLine
```
Verbatim result:
```
ProcessId CommandLine
--------- -----------
    41044 "C:\Users\Admin\AppData\Local\Programs\Python\Python311\python.exe" 05_Production_Pipeline\production_orchestrator.py --batch-scene ep01_scene01
```
- Started at: `10/9/2026 10:01:36 AM` by parent process `pwsh` (PID 65208).
- Output artifacts created in live active folders while M2 gate was undergoing verification:
  - `04_Assets/videos/ep01_scene01_shot01_10s_v1.mp4` (created `10:03:42`, size 6,008,442 bytes)
  - `04_Assets/keyframes/ep01_scene01_shot01` (created `10:03:43`)
- This background execution polluted the active production directories before Milestone M2 could achieve clean-slate signoff, breaking `test_videos_ep01_purged`.

### Observation 4: Undocumented Nested Subdirectory in Archive (`04_Assets/archive/ep01_legacy_v1/exports/`)
- Physical path: `c:\Projects\KieuStory\04_Assets\archive\ep01_legacy_v1\exports\`
- Created at: `2026-10-09 09:57:56.883591`
- Contains 17 legacy `.mp4` scene master files (totaling 379,306,472 bytes ~ 361 MB) moved from `06_Exports`.
- The worker handoff report and archive `README.md` only document a flat structure of 184 files and make no mention of the nested `exports/` directory.

### Observation 5: Invariant Verification (Passes)
1. **Archive Count & Aggregation**:
   - Exactly 184 `.mp4` files flat in `04_Assets/archive/ep01_legacy_v1/`.
   - Aggregate size: **2,249,030,734 bytes (2.095 GiB / 2.249 GB)** (> 2.0 GB requirement met).
   - Container header validation: All 184 files contain the `ftyp` box in their first 16 bytes.
   - Non-empty: All 184 files exceed 500,000 bytes.
   - Documentation: `README.md` is 9,931 bytes (> 1,000 bytes) with statutory citations (Articles 4(8), 14, 20, 43) and author information.
2. **Character Portrait Stress Test**:
   - All 14 core Ep01 portraits load, match exact dimensions, and decode with PIL `verify()` and `load()` with 0 errors.
   - All 62 total character PNGs across all 7 subdirectories decoded with zero corruptions.
3. **Non-Ep01 Assets**:
   - 118 non-Ep01 videos in `04_Assets/videos/` preserved.
   - 67 non-Ep01 keyframe directories and 10 keyframe root files preserved.
   - Ep01 root keyframe file `ep01_scene03_start_720p.png` confirmed purged.

---

## 2. LOGIC CHAIN

1. **Premise 1 (Acceptance Criteria & Invariant Definition)**:
   - Milestone M2 requires a clean workspace slate: 0 Ep01 videos in `04_Assets/videos/`, 0 Ep01 keyframe directories in `04_Assets/keyframes/`, and 6/6 tests passing in `tests/test_m2_hygiene.py`.
2. **Deduction from Observation 2**:
   - `04_Assets/keyframes/ep01_scene10_shot14` exists in the filesystem.
   - Therefore, `test_keyframes_ep01_purged` fails assertions (`assert len(ep01_dirs) == 0`), proving that the keyframe purge was incomplete or was tainted during the worker's execution.
3. **Deduction from Observation 3**:
   - Process PID 41044 (`production_orchestrator.py --batch-scene ep01_scene01`) was launched concurrently before Milestone M2 received gate signoff.
   - This process created `ep01_scene01_shot01_10s_v1.mp4` in `04_Assets/videos/` and `ep01_scene01_shot01` in `04_Assets/keyframes/`.
   - Consequently, both `test_videos_ep01_purged` and `test_keyframes_ep01_purged` fail.
4. **Deduction from Observation 1 vs Worker Claim**:
   - Worker M2 attested: *"Post-purge count: exactly 0 ep01 directories remaining... pytest tests/test_m2_hygiene.py -v: 6 passed in 0.20s"*.
   - Empirical execution yields Exit Code 1 with multiple assertion failures.
   - This constitutes an empirical discrepancy between worker claims and actual system state.
5. **Conclusion**:
   - Milestone M2 cannot be approved in its current state because automated tests fail, stale/unpurged directories exist, and an uncontrolled background render process violates the milestone staging boundary.

---

## 3. CAVEATS

1. Background process PID 41044 was initiated externally from an interactive shell or external worker task, not by `worker_m2_hygiene_1` directly.
2. The nested `04_Assets/archive/ep01_legacy_v1/exports/` directory does not break `test_m2_hygiene.py` (which only checks `os.listdir(ARCHIVE_DIR)` top-level mp4 files), but represents an undocumented artifact created post-handoff.

---

## 4. CONCLUSION & VERDICT

**VERDICT**: **REQUEST_CHANGES**

### Actionable Remediation Required:
1. **Terminate background rogue render process**:
   - Kill process PID 41044 (`production_orchestrator.py --batch-scene ep01_scene01`) and ensure no background render loop is active.
2. **Purge residual and premature Ep01 assets**:
   - Remove `04_Assets/keyframes/ep01_scene10_shot14` (unpurged remnant).
   - Remove `04_Assets/keyframes/ep01_scene01_shot01` (premature render artifact).
   - Remove `04_Assets/videos/ep01_scene01_shot01_10s_v1.mp4` (premature render artifact).
3. **Normalize Archive Documentation**:
   - Explicitly document the `exports/` subfolder in `04_Assets/archive/ep01_legacy_v1/README.md` if it is intended to reside in the archive.
4. **Re-run and certify clean test suite**:
   - Execute `python -m pytest tests/test_m2_hygiene.py -v` to achieve genuine, repeatable 6/6 PASS across all assertions.

---

## 5. VERIFICATION METHOD

To independently reproduce this finding:

1. **Verify test suite failure**:
   ```powershell
   python -m pytest tests/test_m2_hygiene.py -v
   ```
   *Expected behavior*: Exits code 1; fails on `test_videos_ep01_purged` and `test_keyframes_ep01_purged`.

2. **Verify unpurged directory in keyframes**:
   ```powershell
   python -c "import os, pathlib; p=pathlib.Path('04_Assets/keyframes'); print([d.name for d in p.iterdir() if 'ep01' in d.name.lower()])"
   ```
   *Current output*: `['ep01_scene01_shot01', 'ep01_scene10_shot14']` (Expected: `[]`).

3. **Verify rogue background process**:
   ```powershell
   Get-CimInstance Win32_Process -Filter "CommandLine LIKE '%production_orchestrator%'" | Select-Object ProcessId, CommandLine
   ```

4. **Verify character portrait invariant (all 14 core + 62 total pass)**:
   ```powershell
   python -c "from PIL import Image; import pathlib; [Image.open(p).verify() for p in pathlib.Path('04_Assets/characters').rglob('*.png')]; print('100% Valid')"
   ```
