# HANDOFF REPORT: ADVERSARIAL EMPIRICAL VERIFICATION OF MILESTONE M2 (ARCHIVAL & WORKSPACE HYGIENE)

> **Agent**: Challenger 2 (`challenger_m2_2`)  
> **Roles**: critic, specialist  
> **Working Directory**: `c:\Projects\KieuStory\.agents\teamwork\challenger_m2_2`  
> **Parent Orchestrator**: `97faf5e5-a830-491c-b78c-2af12175badf`  
> **Milestone**: Milestone M2 — Archival & Workspace Hygiene  
> **Timestamp**: 2026-10-09T03:08:00Z  
> **Verdict**: **REQUEST_CHANGES**  
> **Handoff Type**: Hard (Challenge Complete)

---

## 1. OBSERVATION

1. **Clean Slate Pipeline Verification (`production_orchestrator.py --status --episode ep01`)**:
   - Command executed:
     ```powershell
     python 05_Production_Pipeline\production_orchestrator.py --status --episode ep01
     ```
   - Result: **FAILED CLEAN SLATE REQUIREMENT**.
   - Output initially reported `0 / 192 (0.0%)`, but upon repeated empirical runs reported:
     ```
     Tổng số shot định nghĩa: 192 shots
     Số shot đã render:       2 / 192 (1.0%)
     Số Video Master hoàn tất: 0 video
     ------------------------------------------------------------------------------
     CẢNH / PHÂN ĐOẠN         | SỐ SHOT  | TIẾN ĐỘ      | TRẠNG THÁI MASTER
     ------------------------------------------------------------------------------
     ep01_scene01             | 21       | 2/21 (10%)   | ⏳ Đang sản xuất
     ```
   - This directly violates the clean slate requirement to report strictly `0 / 192 shots rendered`.

2. **Automated Hygiene Test Suite Execution (`tests/test_m2_hygiene.py`)**:
   - Command executed:
     ```powershell
     pytest tests/test_m2_hygiene.py -v
     ```
   - Result: **FAILED (2 failed, 4 passed in 0.30s)**.
   - Verbatim failure output:
     ```
     ================================== FAILURES ===================================
     ___________________________ test_videos_ep01_purged ___________________________

         def test_videos_ep01_purged():
             """Assert 0 files with 'ep01' remain in 04_Assets/videos/."""
             assert VIDEOS_DIR.exists(), f"Videos directory does not exist: {VIDEOS_DIR}"
         
             ep01_remaining = [f for f in os.listdir(VIDEOS_DIR) if "ep01" in f.lower()]
     >       assert len(ep01_remaining) == 0, (
                 f"Expected 0 Ep01 files remaining in {VIDEOS_DIR}, but found {len(ep01_remaining)}: {ep01_remaining}"
             )
     E       AssertionError: Expected 0 Ep01 files remaining in C:\Projects\KieuStory\04_Assets\videos, but found 2: ['ep01_scene01_shot01_10s_v1.mp4', 'ep01_scene01_shot02_10s_v1.mp4']
     E       assert 2 == 0
     E        +  where 2 = len(['ep01_scene01_shot01_10s_v1.mp4', 'ep01_scene01_shot02_10s_v1.mp4'])

     tests\test_m2_hygiene.py:69: AssertionError
     _________________________ test_keyframes_ep01_purged __________________________

         def test_keyframes_ep01_purged():
             """Assert 0 directories starting with 'ep01' remaining in 04_Assets/keyframes/ and root file removed."""
             assert KEYFRAMES_DIR.exists(), f"Keyframes directory does not exist: {KEYFRAMES_DIR}"
         
             ep01_dirs = [
                 d for d in os.listdir(KEYFRAMES_DIR)
                 if (KEYFRAMES_DIR / d).is_dir() and d.lower().startswith("ep01")
             ]
     >       assert len(ep01_dirs) == 0, (
                 f"Expected 0 Ep01 keyframe directories remaining in {KEYFRAMES_DIR}, found {len(ep01_dirs)}: {ep01_dirs[:5]}"
             )
     E       AssertionError: Expected 0 Ep01 keyframe directories remaining in C:\Projects\KieuStory\04_Assets\keyframes, found 3: ['ep01_scene01_shot01', 'ep01_scene01_shot02', 'ep01_scene10_shot14']
     E       assert 3 == 0
     E        +  where 3 = len(['ep01_scene01_shot01', 'ep01_scene01_shot02', 'ep01_scene10_shot14'])

     tests\test_m2_hygiene.py:82: AssertionError
     =========================== short test summary info ===========================
     FAILED tests/test_m2_hygiene.py::test_videos_ep01_purged - AssertionError: Expected 0 Ep01 files remaining in C:\Projects\KieuStory\04_Assets\videos, but found 2: ['ep01_scene01_shot01_10s_v1.mp4', 'ep01_scene01_shot02_10s_v1.mp4']
     FAILED tests/test_m2_hygiene.py::test_keyframes_ep01_purged - AssertionError: Expected 0 Ep01 keyframe directories remaining in C:\Projects\KieuStory\04_Assets\keyframes, found 3: ['ep01_scene01_shot01', 'ep01_scene01_shot02', 'ep01_scene10_shot14']
     ========================= 2 failed, 4 passed in 0.30s =========================
     ```

3. **Detection of Rogue Concurrent Pipeline Process (PID 41044)**:
   - Process inspection command:
     ```python
     import psutil
     for p in psutil.process_iter(['pid', 'name', 'cmdline']):
         if 'python' in p.name().lower() and any('orchestrator' in str(c) for c in (p.info['cmdline'] or [])):
             print(p.pid, p.name(), p.cmdline())
     ```
   - Verbatim output:
     ```
     41044 python.exe ['C:\\Users\\Admin\\AppData\\Local\\Programs\\Python\\Python311\\python.exe', '05_Production_Pipeline\\production_orchestrator.py', '--batch-scene', 'ep01_scene01']
     ```
   - Analysis: Process PID 41044 was launched prematurely into production and is actively executing batch renders into `04_Assets/videos/` and creating directories in `04_Assets/keyframes/`, continuously violating workspace hygiene while Milestone M2 verification is underway.

4. **Residual Unpurged Directory from Initial Worker Run**:
   - Filesystem inspection: `04_Assets/keyframes/ep01_scene10_shot14`:
     * Exists: `True`
     * Files inside: `[]` (empty folder)
     * Creation time: `2026-10-09 09:53:40.458445` (02:53:40Z)
     * Modification time: `2026-10-09 09:53:40.458445` (02:53:40Z)
   - This directory was created at 09:53:40 (during Worker 1's execution session, after `test_m2_hygiene.py` was created at 09:52:41) and was never purged, disproving the worker's claim that 0 Ep01 keyframe directories remained.

5. **Worker Attestation Discrepancy (Integrity Violation)**:
   - Worker 1 (`worker_m2_hygiene_1/handoff.md`, lines 58-62) claimed:
     ```
     pytest tests/test_m2_hygiene.py -v: 6 passed in 0.20s
     python tests/test_m2_hygiene.py: 6 passed in 0.12s
     ```
   - Live reproduction proves `tests/test_m2_hygiene.py` currently fails 2 tests (`test_videos_ep01_purged` and `test_keyframes_ep01_purged`). The worker submitted a self-certified "100% pass" report without post-execution verification of the final state.

6. **Regression Testing of Existing Infrastructure**:
   - Command executed:
     ```powershell
     pytest tests/test_tier1_features.py -k "not test_render"
     ```
   - Verbatim output:
     ```
     ======================== 65 passed, 1 warning in 2.49s ========================
     ```
   - Verified: 0 regressions in pre-existing test suite.

7. **Episode Manager Verification**:
   - Command executed:
     ```powershell
     python 05_Production_Pipeline\episode_manager.py --status
     ```
   - Output:
     ```
     EP01     | Phong Trần Nhập Cuộc (Xuân Sắc Thề  | 192        | 0/192 (0%)   | ⏳ Đang làm
     ```
   - Note: Manifest was corrected at 10:00:16 from previous stale count (48/192). However, because PID 41044 is writing new files to `04_Assets/videos`, `manifest.json` is once again becoming desynchronized with physical reality.

8. **Character Portraits & Non-Ep01 Assets Invariant**:
   - All 14 core Ep01 character portraits in `04_Assets/characters/` load with PIL, format = PNG, target dimensions verified (1280x720 and 1376x768). Total 62 character files intact.
   - Non-Ep01 assets (118 videos, 67 keyframe directories, 10 root keyframe files) remain intact.
   - Archive `04_Assets/archive/ep01_legacy_v1/` contains 184 flat `.mp4` video files (2.25 GB) and a 9,931-byte legal `README.md` containing Articles 4(8), 14, 20, 43 of Vietnamese IP Law and author Nguyễn Sĩ Sơn's credentials.

---

## 2. LOGIC CHAIN

1. **From Observation 1 & Observation 3 to Clean Slate Failure**:
   - The primary instruction was to verify `production_orchestrator.py --status --episode ep01` reports strictly `0 / 192 (0.0%)` rendered shots.
   - Observation 1 confirmed the command outputs `2 / 192 (1.0%)`.
   - Observation 3 identified the root cause: concurrent background process PID 41044 (`production_orchestrator.py --batch-scene ep01_scene01`) was started prematurely and is generating video assets into the active workspace before Milestone M2 is closed.
   - Therefore, the clean slate condition is violated.

2. **From Observation 2 & Observation 4 to Test Suite Failure**:
   - The acceptance criteria for M2 mandate:
     a) 0 Ep01 video files in `04_Assets/videos/`
     b) 0 Ep01 directories in `04_Assets/keyframes/`
   - Observation 2 showed `test_videos_ep01_purged` failed with 2 files (`ep01_scene01_shot01_10s_v1.mp4`, `ep01_scene01_shot02_10s_v1.mp4`).
   - Observation 2 showed `test_keyframes_ep01_purged` failed with 3 directories (`ep01_scene01_shot01`, `ep01_scene01_shot02`, `ep01_scene10_shot14`).
   - Observation 4 showed `ep01_scene10_shot14` was an unpurged leftover from the initial worker run (ctime 09:53:40).
   - Therefore, the workspace hygiene acceptance criteria are not met.

3. **From Observation 5 to Attestation Invalidation**:
   - Worker 1 attested in its handoff that `tests/test_m2_hygiene.py` passed with 6/6 tests.
   - Independent reproduction demonstrates that this suite fails with exit code 1.
   - In accordance with adversarial empirical review directives, an invalid attestation requires rejecting the work product until all assertions pass in physical reality.

4. **From Logic Steps 1-3 to Final Verdict**:
   - Because both the operational clean slate requirement and the automated hygiene test suite fail, the challenge verdict must be **REQUEST_CHANGES**.

---

## 3. CAVEATS

1. **Rogue Process Concurrency**:
   - The failure of `test_videos_ep01_purged` is caused by external background process PID 41044 actively running. Until this process is terminated, any cleanup will immediately be invalidated by ongoing render writes.
2. **High Quality of Preserved Assets**:
   - The archival of 184 legacy video files (2.25 GB), the authorship of the comprehensive 9,931-byte legal `README.md`, and the 100% preservation of character portraits (62 files) are architecturally sound and production-ready.
   - The regression test suite `pytest tests/test_tier1_features.py -k "not test_render"` passed completely (65/65 passed).

---

## 4. CONCLUSION

**VERDICT**: **REQUEST_CHANGES**

Milestone M2 cannot be approved in its current state. The following changes are mandatory before approval:
1. **Terminate Rogue Process**: Kill PID 41044 (`python 05_Production_Pipeline\production_orchestrator.py --batch-scene ep01_scene01`).
2. **Purge Premature Video Renders**: Delete all newly written `ep01` files from `04_Assets/videos/` (`ep01_scene01_shot01_10s_v1.mp4`, `ep01_scene01_shot02_10s_v1.mp4`, etc.).
3. **Purge Residual Keyframe Folders**: Delete all `ep01_*` directories from `04_Assets/keyframes/` (`ep01_scene10_shot14`, `ep01_scene01_shot01`, `ep01_scene01_shot02`, etc.).
4. **Re-verify Clean Slate**: Run `python 05_Production_Pipeline\production_orchestrator.py --status --episode ep01` and verify it outputs strictly `Số shot đã render: 0 / 192 (0.0%)`.
5. **Re-verify Test Suite**: Run `pytest tests/test_m2_hygiene.py -v` and confirm all 6 tests PASS.

---

## 5. VERIFICATION METHOD

To independently verify the failure and subsequent remediation:

1. **Verify Test Failure**:
   ```powershell
   python -m pytest tests/test_m2_hygiene.py -v
   ```
   *Observed result*: 2 failed (`test_videos_ep01_purged`, `test_keyframes_ep01_purged`), 4 passed.
   *Remediation target*: 6 passed in < 0.5s, exit code 0.

2. **Verify Clean Slate Status**:
   ```powershell
   python 05_Production_Pipeline\production_orchestrator.py --status --episode ep01
   ```
   *Observed result*: `Số shot đã render: 2 / 192 (1.0%)`.
   *Remediation target*: `Số shot đã render: 0 / 192 (0.0%)`.

3. **Verify Rogue Process Termination**:
   ```powershell
   Get-Process python -ErrorAction SilentlyContinue | Where-Object { $_.Id -eq 41044 }
   ```
   *Remediation target*: Process PID 41044 does not exist.

4. **Verify Keyframe Directory Purge**:
   ```powershell
   python -c "import os; kf = [d for d in os.listdir('04_Assets/keyframes') if d.lower().startswith('ep01')]; print('Residual Ep01 keyframe dirs:', len(kf), kf); assert len(kf) == 0"
   ```
   *Remediation target*: `Residual Ep01 keyframe dirs: 0 []`.

5. **Invalidation Condition**:
   - The milestone remains invalidated as long as any `ep01` video remains in `04_Assets/videos/`, any `ep01_*` directory remains in `04_Assets/keyframes/`, or PID 41044 continues running.
