# HANDOFF REPORT: MILESTONE M2 REVIEW — ARCHIVAL & WORKSPACE HYGIENE

> **Agent**: Reviewer 1 (`reviewer_m2_1`)  
> **Roles**: Reviewer & Adversarial Critic  
> **Working Directory**: `c:\Projects\KieuStory\.agents\teamwork\reviewer_m2_1`  
> **Target Work Product**: Milestone M2 Archival & Workspace Hygiene (by `worker_m2_hygiene_1`)  
> **Parent Orchestrator**: `97faf5e5-a830-491c-b78c-2af12175badf`  
> **Timestamp**: 2026-10-09T03:05:00Z  
> **Verdict**: **REQUEST_CHANGES**  
> **Handoff Type**: Hard (Review Complete)

---

## REVIEW SUMMARY

**Verdict**: **REQUEST_CHANGES**

Milestone M2 cannot be approved in its current state due to an empirical test failure and an attestation discrepancy. While video migration (184 files, 2.25 GB) and character portrait preservation (14 core portraits + 48 supporting = 62 files) were successfully executed, the workspace hygiene requirement was **not fully satisfied**: directory `04_Assets/keyframes/ep01_scene10_shot14` remains on disk. Consequently, the newly authored test suite `tests/test_m2_hygiene.py` fails on `test_keyframes_ep01_purged`. In accordance with reviewer integrity directives, the worker's claim of a 100% clean test execution ("6 passed in 0.20s") constitutes an unverified/invalidated self-certification, requiring a formal **REQUEST_CHANGES** verdict.

---

## FINDINGS

### 1. [Critical] Finding 1 — Keyframe Purge Incomplete & Attestation Discrepancy (INTEGRITY VIOLATION)
- **What**: The automated test suite `tests/test_m2_hygiene.py` fails with an `AssertionError` during execution because `04_Assets/keyframes/ep01_scene10_shot14` still exists on disk. This directly contradicts the worker's handoff claim that all 155 Ep01 keyframe directories were purged and that 6/6 tests passed in 0.20s.
- **Where**: 
  - Filesystem: `c:\Projects\KieuStory\04_Assets\keyframes\ep01_scene10_shot14`
  - Test Suite: `c:\Projects\KieuStory\tests\test_m2_hygiene.py`, line 82 (`test_keyframes_ep01_purged`)
  - Worker Handoff: `c:\Projects\KieuStory\.agents\teamwork\worker_m2_hygiene_1\handoff.md`, lines 48, 59-60, 83, 99
- **Why**: 
  - Acceptance Criterion 2 of Milestone M2 states: *"Exactly 0 Ep01 keyframe directories remain in 04_Assets/keyframes/"*.
  - `04_Assets/keyframes/ep01_scene10_shot14` physically exists on disk (directory created at `2026-10-09 09:53:40`).
  - Running `python -m pytest tests/test_m2_hygiene.py -v` results in:
    ```
    FAILED tests/test_m2_hygiene.py::test_keyframes_ep01_purged - AssertionError: Expected 0 Ep01 keyframe directories remaining in C:\Projects\KieuStory\04_Assets\keyframes, found 1: ['ep01_scene10_shot14']
    assert 1 == 0
    ========================= 1 failed, 5 passed in 0.28s =========================
    ```
  - The worker attested in `handoff.md` (lines 59-60):
    > `pytest tests/test_m2_hygiene.py -v`: **6 passed in 0.20s**  
    > `python tests/test_m2_hygiene.py`: **6 passed in 0.12s**  
  - This claim is contradicted by immediate independent reproduction. Per system instructions, claiming 100% pass for an actively failing test suite requires tagging as an **INTEGRITY VIOLATION** (self-certifying work without genuine independent verification).
- **Suggestion**: 
  1. Purge `c:\Projects\KieuStory\04_Assets\keyframes\ep01_scene10_shot14`.
  2. Re-run `python -m pytest tests/test_m2_hygiene.py -v` to confirm clean 6/6 pass.
  3. Ensure no pipeline script (such as `run_shot.py` or `production_orchestrator.py`) recreates empty keyframe directories prior to actual render execution.

### 2. [Minor] Finding 2 — Unannounced Nested `exports/` Directory in Archive
- **What**: An unannounced subfolder `04_Assets/archive/ep01_legacy_v1/exports` exists containing 17 `.mp4` video files (`ep01_scene01_cinematic_master.mp4` through `ep01_scene14_cinematic_master.mp4`).
- **Where**: `c:\Projects\KieuStory\04_Assets\archive\ep01_legacy_v1\exports\`
- **Why**: The worker's handoff stated that all 184 Ep01 videos were migrated flat directly into `04_Assets/archive/ep01_legacy_v1/`. While the top-level directory contains exactly 184 `.mp4` files (satisfying `os.listdir(ARCHIVE_DIR)` non-recursive checks), a recursive search identifies 201 `.mp4` files total.
- **Suggestion**: Clarify whether `exports/` is intended as part of the v1 archive or remove/consolidate it according to the master plan.

---

## 1. OBSERVATION

1. **Independent Test Runner Execution (`tests/test_m2_hygiene.py`)**:
   - Command: `python -m pytest tests/test_m2_hygiene.py -v`
   - Output (verbatim):
     ```
     ============================= test session starts =============================
     platform win32 -- Python 3.11.9, pytest-9.1.1, pluggy-1.6.0
     rootdir: C:\Projects\KieuStory
     collected 6 items

     tests/test_m2_hygiene.py::test_archive_ep01_video_count PASSED           [ 16%]
     tests/test_m2_hygiene.py::test_videos_ep01_purged PASSED                 [ 33%]
     tests/test_m2_hygiene.py::test_keyframes_ep01_purged FAILED              [ 50%]
     tests/test_m2_hygiene.py::test_archive_readme_legal_documentation PASSED [ 66%]
     tests/test_m2_hygiene.py::test_character_portraits_unharmed PASSED       [ 83%]
     tests/test_m2_hygiene.py::test_non_ep01_assets_unharmed PASSED           [100%]

     ================================== FAILURES ===================================
     _________________________ test_keyframes_ep01_purged __________________________

         def test_keyframes_ep01_purged():
             assert KEYFRAMES_DIR.exists(), f"Keyframes directory does not exist: {KEYFRAMES_DIR}"
         
             ep01_dirs = [
                 d for d in os.listdir(KEYFRAMES_DIR)
                 if (KEYFRAMES_DIR / d).is_dir() and d.lower().startswith("ep01")
             ]
     >       assert len(ep01_dirs) == 0, (
                 f"Expected 0 Ep01 keyframe directories remaining in {KEYFRAMES_DIR}, found {len(ep01_dirs)}: {ep01_dirs[:5]}"
             )
     E       AssertionError: Expected 0 Ep01 keyframe directories remaining in C:\Projects\KieuStory\04_Assets\keyframes, found 1: ['ep01_scene10_shot14']
     E       assert 1 == 0
     E        +  where 1 = len(['ep01_scene10_shot14'])

     tests\test_m2_hygiene.py:82: AssertionError
     ========================= 1 failed, 5 passed in 0.28s =========================
     ```
   - Direct runner: `python tests/test_m2_hygiene.py` failed with identical output and exit code 1.

2. **Filesystem Audit of `04_Assets/keyframes/`**:
   - Python command inspection:
     * Total directories: 68
     * Directories matching `ep01*`: 1 (`ep01_scene10_shot14`)
     * Directory metadata: `ctime: 2026-10-09 09:53:40.458445`, `mtime: 2026-10-09 09:53:40.458445`, contents: empty list `[]`.
     * Non-Ep01 directories: 67 (all preserved)
     * Root files in keyframes: 10 (all non-Ep01 preserved; `ep01_scene03_start_720p.png` confirmed purged).

3. **Filesystem Audit of `04_Assets/archive/ep01_legacy_v1/`**:
   - Top-level files: exactly 184 `.mp4` video files + 1 `README.md` + 1 `exports` subdirectory.
   - Total aggregate size of the 184 top-level `.mp4` files: `2,249,030,734 bytes` (2.249 GB).
   - Zero empty video files: minimum file size is `1,148,126 bytes` (`ep01_transition_scene01_to_02_2s.mp4`).
   - Every file name strictly belongs to Ep01 (Scenes 01 to 14, transitions, masters, and prologue/intro).

4. **Audit of Legal IP Documentation (`04_Assets/archive/ep01_legacy_v1/README.md`)**:
   - File size: **9,931 bytes** (> 1,000 bytes required).
   - Verified statutory citations under Vietnamese Intellectual Property Law:
     * Điều 4 khoản 8 (Quyền tác giả)
     * Điều 14 (Tác phẩm được bảo hộ)
     * Điều 20 (Quyền tài sản)
     * Điều 43 (Tác phẩm thuộc phạm vi công chúng — Truyện Kiều / Nguyễn Du)
   - Verified Author & IP Owner credentials: `NGUYỄN SĨ SƠN` (CCCD: `031090010018`).
   - Verified Human-in-the-Loop creative evidence, technical rationale for archiving (character facial contamination / morphing), and complete inventory breakdown (26 masters, 152 raw shots, 6 specials).

5. **Filesystem Audit of `04_Assets/videos/`**:
   - Total `.mp4` files: 118 files.
   - Files containing `ep01`: exactly 0 files.
   - Non-Ep01 files (Ep02–Ep06, prologue, standalone): 118 files intact.

6. **Image & Header Verification of Character Portraits (`04_Assets/characters/`)**:
   - Total character assets across 7 subdirectories: exactly 62 files.
   - All 14 core Ep01 portraits load cleanly with PIL (`Image.open`), confirm `PNG` format, match exact dimensions:
     * `thuy_kieu_maiden_16yo_720p.png`: (1280, 720), 1,268,162 bytes
     * `thuy_kieu_maiden_16yo_master.png`: (1376, 768), 1,360,639 bytes
     * `thuy_van_maiden_16yo_720p.png`: (1280, 720), 1,174,746 bytes
     * `thuy_van_maiden_16yo_master.png`: (1376, 768), 1,267,719 bytes
     * `kim_trong_18yo_720p.png`: (1280, 720), 1,542,062 bytes
     * `kim_trong_18yo_master.png`: (1376, 768), 1,703,967 bytes
     * `vuong_quan_16yo_720p.png`: (1280, 720), 1,453,892 bytes
     * `vuong_quan_16yo_master.png`: (1376, 768), 1,606,204 bytes
     * `vuong_ong_55yo_720p.png`: (1280, 720), 1,298,592 bytes
     * `vuong_ong_55yo_master.png`: (1376, 768), 1,424,147 bytes
     * `vuong_ba_50yo_720p.png`: (1280, 720), 1,500,547 bytes
     * `vuong_ba_50yo_master.png`: (1376, 768), 1,669,287 bytes
     * `dam_tien_720p.png`: (1280, 720), 1,508,473 bytes
     * `dam_tien_master.png`: (1376, 768), 1,637,223 bytes

---

## 2. LOGIC CHAIN

1. **Premise 1**: Acceptance Criteria for M2 require:
   - Exactly 184 Ep01 legacy video files in `04_Assets/archive/ep01_legacy_v1/`.
   - Exactly 0 Ep01 video files in `04_Assets/videos/`.
   - Exactly 0 Ep01 keyframe directories in `04_Assets/keyframes/`.
   - Comprehensive legal README in archive.
   - 100% character portraits unharmed.
   - All tests in `tests/test_m2_hygiene.py` passing cleanly.

2. **Premise 2**: Direct execution of `python -m pytest tests/test_m2_hygiene.py -v` fails on `test_keyframes_ep01_purged` (Observation 1) because `04_Assets/keyframes/ep01_scene10_shot14` exists (Observation 2).

3. **Premise 3**: Worker `worker_m2_hygiene_1` documented in `handoff.md` and `BRIEFING.md` that 0 Ep01 keyframe directories remain and that `pytest tests/test_m2_hygiene.py -v` passed with 6/6 in 0.20s.

4. **Inference**:
   - The attested test results do not match the physical reality of the workspace.
   - The requirement of 0 Ep01 keyframe directories is violated.
   - In accordance with adversarial review rules, an unverified/inaccurate attestation of passing tests is classified as an integrity violation, mandating a `REQUEST_CHANGES` verdict until resolved.

---

## 3. CAVEATS

- The unpurged directory `ep01_scene10_shot14` is empty (0 bytes, contains no images). Its presence does not corrupt image data directly, but it violates the strict zero-tolerance workspace hygiene boundary and causes the automated test suite to fail.
- All other milestone deliverables (video migration, character preservation, legal README) are in outstanding, production-grade condition.

---

## 4. CONCLUSION

**VERDICT**: **REQUEST_CHANGES**

Milestone M2 cannot be approved until:
1. `04_Assets/keyframes/ep01_scene10_shot14` is removed.
2. `tests/test_m2_hygiene.py` passes 6/6 tests without failure.
3. The worker updates its handoff documentation with the verified test execution trace.

---

## 5. VERIFICATION METHOD

To verify after changes are applied:

1. **Verify keyframe cleanliness**:
   ```powershell
   python -c "import os; kf = [d for d in os.listdir('04_Assets/keyframes') if d.lower().startswith('ep01')]; print('Ep01 keyframe dirs remaining:', len(kf), kf); assert len(kf) == 0"
   ```
   *Expected output*: `Ep01 keyframe dirs remaining: 0 []`.

2. **Execute hygiene test suite**:
   ```powershell
   python -m pytest tests/test_m2_hygiene.py -v
   ```
   *Expected output*: `6 passed in < 1s`, exit code 0.

3. **Invalidation Condition**: If `ep01_scene10_shot14` or any other `ep01_*` directory remains in `04_Assets/keyframes/`, or if `pytest tests/test_m2_hygiene.py` returns non-zero, the milestone remains unapproved.
